{"text_format":"1","workbook":"xlsx","n_sheets":22,"sheets":["Intro","Setup","Players","Table","Stunty","GroupFixtures","GroupTable","Presentation","GroupMatrix","Matrix","Round1","Round2","Round3","Round4","Round5","Round6","Round7","Round8","Round9","NAF","Working","ChangeLog"],"not_rendered":{"charts":0,"images":0,"macros":1,"external_links":0,"defined_names":35,"comments":3,"pivot_tables":0},"unopened":[],"bounds":{"document_bytes":16777216,"sheet_cells":100000,"rows_first":2000,"rows_last":500,"rows_between":2000,"halvings":0,"cell_chars":16384,"cell_head_chars":4096},"cells_cut":0,"cells_raw":0,"read":"whole","date_system":"1900"}

{"sheet":"Intro","index":0,"n_rows":19,"n_cols":18,"rows_kept":19,"cut":false,"hidden":false,"merged":[]}
[]
[null,"Buttons for running a tournament:",null,null,null,null,null,null,null,null,null,null,null,null,null,null,null,"Setup Tabs"]
[null,null,null,null,null,null,null,null,null,null,null,null,null,null,null,null,null,"Presentation Tabs"]
[null,null,null,null,null,null,null,null,null,null,null,null,null,null,null,null,null,"Round Results"]
[null,null,null,null,null,null,null,null,null,null,null,null,null,null,null,null,null,"Other"]
[]
[]
[]
[]
[]
[]
[]
[]
[]
[]
{"$rows_left_out":5}
{"sheet":"Setup","index":1,"n_rows":24,"n_cols":11,"rows_kept":24,"cut":false,"hidden":false,"merged":[]}
["SCORING SETUP",null,null,"Group/Ind Swiss?","Individual",null,"Individual Tie Breaks",null,null,"Group Tie Breaks"]
[null,null,null,null,null,null,"Player",null,null,"Group"]
["Points for…",null,null,"Name of First Bonus","Bonus1",null,"Points","Order",null,"Points","Order"]
["Win by at least 2 TD",2,null,"Name of Second Bonus","Bonus2",null,"TD For",null,null,"TD For"]
["Win by 1 TD",2,null,null,null,null,"TD Against",null,null,"TD Against"]
["Draw",1,null,null,null,null,"TD Net",2,null,"Net TDs",2]
["Lose by 1 TD",0,null,null,null,null,"Cas For",null,null,"Cas For"]
["Lose by at least 2 TD",0,null,null,null,null,"Cas Against",null,null,"Cas Against"]
[null,null,null,null,null,null,"Cas Net",3,null,"Net Cas",3]
["Bonus points for TD/Cas etc",null,null,"Test Individual Scoring System Here",null,null,{"$f":"Working!AG16","v":"Bonus1"},null,null,{"$f":"\"Group Total \"&Working!AG16","v":"Group Total Bonus1"}]
["Points per TD",0,null,"Your Score (required)",4,null,{"$f":"Working!AG17","v":"Bonus2"},null,null,{"$f":"\"Group Total \"&Working!AG17","v":"Group Total Bonus2"}]
["Max TD Bonus Pts",0,null,"Opponent Score (required)",3,null,"Wins",null,null,"Group Wins"]
["Points per Cas",0,null,"Your Cas (optional)",3,null,"Draws",null,null,"Groups Draws"]
["Max Cas Bonus Pts",0,null,{"$f":"\"Your \"&Working!AG16&\" (optional)\"","v":"Your Bonus1 (optional)"},1,null,"Losses",null,null,"Group Losses"]
[{"$f":"Working!AG16&\" Max Bonus Pts\"","v":"Bonus1 Max Bonus Pts"},0,null,{"$f":"\"Your \"&Working!AG17&\" (optional)\"","v":"Your Bonus2 (optional)"},2,null,"Opp Score",1,null,"Individual Wins"]
{"$rows_left_out":10}
{"sheet":"Players","index":2,"n_rows":160,"n_cols":16,"rows_kept":160,"cut":false,"hidden":false,"merged":[]}
["Num","Display Name","NAF Name","NAF Number","Race","Group","Stunty","Adjustment",null,null,null,null,"Groups",null,"Team Size",4]
[{"$f":"IF(C2=\"\",\"\",MAX(A$1:A1)+1)","v":1},"a","a",18857,"Ogre",null,null,null,null,null,null,null,"A"]
[{"$f":"IF(C3=\"\",\"\",MAX(A$1:A2)+1)","v":2},"b","b",7809,"Nurgle",null,null,null,null,null,null,null,"B"]
[{"$f":"IF(C4=\"\",\"\",MAX(A$1:A3)+1)","v":3},"c","c",12001,"Halfling",null,null,null,null,null,null,null,"C"]
[{"$f":"IF(B5=\"\",\"\",MAX(A$1:A4)+1)","v":4},"d","d",15037,"Shambling Undead",null,null,null,null,null,null,null,"D"]
[{"$f":"IF(B6=\"\",\"\",MAX(A$1:A5)+1)","v":5},"e","e",8653,"Goblin",null,null,null,null,null,null,null,"E"]
[{"$f":"IF(C7=\"\",\"\",MAX(A$1:A6)+1)","v":6},"f","f",3607,"Shambling Undead",null,null,null,null,null,null,null,"F"]
[{"$f":"IF(C8=\"\",\"\",MAX(A$1:A7)+1)","v":7},"g","g",10062,"Shambling Undead",null,null,null,null,null,null,null,"G"]
[{"$f":"IF(C9=\"\",\"\",MAX(A$1:A8)+1)","v":8},"h","h",19752,"Daemons of Khorne",null,null,null,null,null,null,null,"H"]
[{"$f":"IF(C10=\"\",\"\",MAX(A$1:A9)+1)","v":9},"i","i",15631,"Bretonnian"]
[{"$f":"IF(B11=\"\",\"\",MAX(A$1:A10)+1)","v":10},"j","j",18159,"Skaven"]
[{"$f":"IF(B12=\"\",\"\",MAX(A$1:A11)+1)","v":11},"k","k",9695,"Black Orc"]
[{"$f":"IF(B13=\"\",\"\",MAX(A$1:A12)+1)","v":12},"l","l",1531,"Nurgle"]
[{"$f":"IF(B14=\"\",\"\",MAX(A$1:A13)+1)","v":13},"m","m",3738,"Chaos Chosen"]
[{"$f":"IF(C15=\"\",\"\",MAX(A$1:A14)+1)","v":14},"n","n",7609,"Old World Alliance"]
{"$rows_left_out":146}
{"sheet":"Table","index":3,"n_rows":15,"n_cols":16,"rows_kept":15,"cut":false,"hidden":false,"merged":[]}
["Player","Points","TD For","TD Against","TD Net","Cas For","Cas Against","Cas Net","Bonus1","Bonus2","Wins","Draws","Losses","Opp Score",null,"Group"]
["d",2,2,2,0,2,1,1,1,0,null,1,null,2]
["c",2,2,2,0,1,0,1,2,3,null,1,null,2]
["b",2,2,2,0,1,2,-1,2,2,null,1,null,2]
["a",2,2,2,0,0,1,-1,3,1,null,1,null,2]
["n",2,3,0,3,3,1,2,2,0,1,null,null,0]
["h",2,3,0,3,0,2,-2,0,2,1,null,null,0]
["k",2,3,2,1,1,3,-2,3,2,1,null,null,0]
["e",1,1,1,0,2,2,0,1,2,null,1,null,1]
["i",1,1,1,0,2,2,0,1,2,null,1,null,1]
["l",0,2,3,-1,3,1,2,2,1,null,null,1,2]
["f",0,0,3,-3,2,0,2,2,0,null,null,1,2]
["m",0,0,3,-3,1,3,-2,2,2,null,null,1,2]
["j",-98,1,0,1,1,1,0,1,3,1,null,null,-100]
["g",-100,0,1,-1,1,1,0,3,1,null,null,1,-98]
{"$rows_left_out":1}
{"sheet":"Stunty","index":4,"n_rows":1,"n_cols":16,"rows_kept":1,"cut":false,"hidden":false,"merged":[]}
["Player","Points","TD For","TD Against","TD Net","Cas For","Cas Against","Cas Net","Bonus1","Bonus2","Wins","Draws","Losses","Opp Score","Race","Group"]

{"sheet":"GroupFixtures","index":5,"n_rows":0,"n_cols":0,"rows_kept":0,"cut":false,"hidden":false,"merged":[]}

{"sheet":"GroupTable","index":6,"n_rows":0,"n_cols":0,"rows_kept":0,"cut":false,"hidden":false,"merged":[]}

{"sheet":"Presentation","index":7,"n_rows":183,"n_cols":9,"rows_kept":183,"cut":false,"hidden":false,"merged":[]}
["Round",1]
[]
["Board","Home","Away","Home Team","Away Team","Home TD","Away TD","Home Cas","Away Cas"]
[1,{"$f":"IF(A4=\"\",\"\",OFFSET(INDIRECT(\"Round\"&Round&\"!B1\"),$A4,0))","v":"d"},{"$f":"IF(A4=\"\",\"\",OFFSET(INDIRECT(\"Round\"&Round&\"!c1\"),$A4,0))","v":"b"},{"$f":"IF(A4=\"\",\"\",OFFSET(INDIRECT(\"Round\"&Round&\"!n1\"),$A4,0))","v":0},{"$f":"IF(A4=\"\",\"\",OFFSET(INDIRECT(\"Round\"&Round&\"!o1\"),$A4,0))","v":0}]
[{"$f":"IF(A4=\"\",A3+1,IF(ROUNDUP(A4/TeamSize,0)=A4/TeamSize,\"\",A4+1))","v":2},"a","c",0,0]
[3,"n","m",0,0]
[4,"i","e",0,0]
["","","","",""]
[5,"l","k",0,0]
[6,"f","h",0,0]
[7,"j","g",0,0]
[8,0,0,0,0]
["","","","",""]
[9,0,0,0,0]
[10,0,0,0,0]
{"$rows_left_out":169}
{"sheet":"GroupMatrix","index":8,"n_rows":0,"n_cols":0,"rows_kept":0,"cut":false,"hidden":false,"merged":[]}

{"sheet":"Matrix","index":9,"n_rows":129,"n_cols":129,"rows_kept":129,"cut":false,"hidden":false,"merged":[]}
[null,"a","b","c","d","e","f","g","h","i","j","k","l","m","n",null,null,null,null,null,null,null,null,null,null,null,null,null,null,null,null,null,null,null,null,null,null,null,null,null,null,null,null,null,null,null,null,null,null,null,null,null,null,null,null,null,null,null,null,null,null,null,null,null,null,null,null,null,null,null,null,null,null,null,null,null,null,null,null,null,null,null,null,null,null,null,null,null,null,null,null,null,null,null,null,null,null,null,null,null,"Driesfield ","kfoged ","Podfrey ","valkohukka ","Skoberget ","brocCooli ","Ploppy_McPloppy ","BiBi ","Matt le fou ","Candlejack ","Purdindas ","JJ ","Wilzif ","noraal ","cz ","Loki ","gninocker ","Mewash ","Leonek ","JamesEs ","Duke_Luthor_Von_Hawkfire ","Jokaero ","Duckwing ","Justicium ","Liam ","Endalos ","bothun ","Inforthepain ","sigu70 "]
["a",null,null,"R1, 1 - 1",null,null,null,null,null,null,null,null,null,null,null,null,null,null,null,null,null,null,null,null,null,null,null,null,null,null,null,null,null,null,null,null,null,null,null,null,null,null,null,null,null,null,null,null,null,null,null,null,null,null,null,null,null,null,null,null,null,null,null,null,null,null,null,null,null,null,null,null,null,null,null,null,null,null,null,null,null,null,null,null,null,null,null,null,null,null,null,null,null,null,null,null,null,null,null,null,"R1, 1 - 0","R5, 1 - 0","R1, 1 - 0","R3, 0 - 1",null,"R4, 1 - 0","R6, 1 - 0",null,"R1, 0.5 - 0.5","R4, 4 - 18","R2, 0 - 1",null,"R4, 1 - 0",null,"R5, 0 - 1","R7, 0.5 - 0.5","R1, 1 - 0","R8, 1 - 0","R3, 0 - 1","R3, 1 - 0","R3, 23 - 5",null,"R3, 0 - 1",null,"R1, 0 - 1",null,null,"R3, 1 - 0","R5, 1 - 0"]
["b",null,null,null,"R1, 1 - 1",null,null,null,null,null,null,null,null,null,null,null,null,null,null,null,null,null,null,null,null,null,null,null,null,null,null,null,null,null,null,null,null,null,null,null,null,null,null,null,null,null,null,null,null,null,null,null,null,null,null,null,null,null,null,null,null,null,null,null,null,null,null,null,null,null,null,null,null,null,null,null,null,null,null,null,null,null,null,null,null,null,null,null,null,null,null,null,null,null,null,null,null,null,null,null,null,"R1, 0.5 - 0.5",null,"R4, 0.5 - 0.5","R5, 0.5 - 0.5","R2, 0 - 1","R1, 1 - 0",null,null,"R4, 0.5 - 0.5",null,"R3, 1 - 0",null,"R1, 0.5 - 0.5",null,"R3, 0.5 - 0.5","R1, 2 - 0",null,null,null,"R1, 1 - 0","R3, 0 - 1","R5, 1 - 0",null,null,"R4, 5 - 22","R6, 0 - 1"]
["c","R1, 1 - 1",null,null,null,null,null,null,null,null,null,null,null,null,null,null,null,null,null,null,null,null,null,null,null,null,null,null,null,null,null,null,null,null,null,null,null,null,null,null,null,null,null,null,null,null,null,null,null,null,null,null,null,null,null,null,null,null,null,null,null,null,null,null,null,null,null,null,null,null,null,null,null,null,null,null,null,null,null,null,null,null,null,null,null,null,null,null,null,null,null,null,null,null,null,null,null,null,null,null,"R1, 0.5 - 0.5","R4, 0.5 - 0.5","R1, 0 - 1","R2, 0.5 - 0.5",null,"R3, 0 - 1","R3, 1 - 0","R4, 0 - 1","R4, 0.5 - 0.5","R5, 3 - 20","R4, 0 - 1",null,null,"R5, 0 - 1","R6, 1 - 0","R6, 1 - 0","R1, 1 - 0","R3, 1 - 0","R2, 0 - 1","R1, 0.5 - 0.5","R2, 0 - 1",null,null,"R2, 0 - 1","R2, 22 - 6","R5, 0.5 - 0.5","R5, 1 - 0","R2, 0 - 1"]
["d",null,"R1, 1 - 1",null,null,null,null,null,null,null,null,null,null,null,null,null,null,null,null,null,null,null,null,null,null,null,null,null,null,null,null,null,null,null,null,null,null,null,null,null,null,null,null,null,null,null,null,null,null,null,null,null,null,null,null,null,null,null,null,null,null,null,null,null,null,null,null,null,null,null,null,null,null,null,null,null,null,null,null,null,null,null,null,null,null,null,null,null,null,null,null,null,null,null,null,null,null,null,null,null,"R4, 0 - 1","R5, 0.5 - 0.5","R1, 0 - 1","R1, 1 - 0","R1, 0.5 - 0.5","R2, 0 - 1","R4, 0.5 - 0.5","R3, 0.5 - 0.5","R7, 1 - 0",null,null,"R6, 0 - 1","R1, 0 - 1","R3, 0.5 - 0.5","R6, 0.5 - 0.5","R4, 0.5 - 0.5","R1, 1 - 0","R4, 0.5 - 0.5",null,"R2, 1 - 0","R1, 0.5 - 0.5","R3, 0 - 1",null,"R3, 21 - 4","R2, 0 - 1","R6, 0.5 - 0.5",null,"R3, 1 - 0","R6, 19 - 3"]
["e",null,null,null,null,null,null,null,null,"R1, 1 - 1",null,null,null,null,null,null,null,null,null,null,null,null,null,null,null,null,null,null,null,null,null,null,null,null,null,null,null,null,null,null,null,null,null,null,null,null,null,null,null,null,null,null,null,null,null,null,null,null,null,null,null,null,null,null,null,null,null,null,null,null,null,null,null,null,null,null,null,null,null,null,null,null,null,null,null,null,null,null,null,null,null,null,null,null,null,null,null,null,null,null,null,null,"R5, 0 - 1","R2, 1 - 0","R1, 0.5 - 0.5","R2, 0.5 - 0.5",null,"R1, 0 - 1","R4, 1 - 0","R5, 1 - 0","R4, 0 - 1","R1, 0 - 1","R5, 0 - 1","R3, 0.5 - 0.5","R1, 0 - 1","R1, 0.5 - 0.5",null,null,"R5, 0 - 1","R1, 0.5 - 0.5",null,null,"R6, 1 - 0","R3, 1 - 0",null,null,"R2, 1 - 0",null,"R6, 0 - 1"]
["f",null,null,null,null,null,null,null,"R1, 0 - 2",null,null,null,null,null,null,null,null,null,null,null,null,null,null,null,null,null,null,null,null,null,null,null,null,null,null,null,null,null,null,null,null,null,null,null,null,null,null,null,null,null,null,null,null,null,null,null,null,null,null,null,null,null,null,null,null,null,null,null,null,null,null,null,null,null,null,null,null,null,null,null,null,null,null,null,null,null,null,null,null,null,null,null,null,null,null,null,null,null,null,null,"R5, 1 - 0","R1, 0 - 1","R5, 0.5 - 0.5","R4, 0 - 1","R6, 0.5 - 0.5",null,"R4, 0.5 - 0.5",null,"R4, 0.5 - 0.5","R6, 0.5 - 0.5","R1, 0.5 - 0.5","R3, 1 - 0","R3, 1 - 0","R6, 0.5 - 0.5","R3, 0.5 - 0.5","R2, 1 - 0","R2, 1 - 0","R3, 0.5 - 0.5","R1, 1 - 0","R7, 1 - 0","R3, 1 - 0","R5, 0.5 - 0.5",null,null,"R3, 1 - 0","R2, 1 - 0","R5, 0 - 1"]
["g",null,null,null,null,null,null,null,null,null,"R1, 0 - 2",null,null,null,null,null,null,null,null,null,null,null,null,null,null,null,null,null,null,null,null,null,null,null,null,null,null,null,null,null,null,null,null,null,null,null,null,null,null,null,null,null,null,null,null,null,null,null,null,null,null,null,null,null,null,null,null,null,null,null,null,null,null,null,null,null,null,null,null,null,null,null,null,null,null,null,null,null,null,null,null,null,null,null,null,null,null,null,null,null,"R1, 1 - 0",null,"R4, 0 - 1","R1, 1 - 0","R3, 1 - 0","R1, 1 - 0",null,"R5, 0.5 - 0.5",null,"R3, 0 - 1","R7, 0 - 1","R4, 1 - 0",null,"R2, 1 - 0",null,"R1, 0 - 1","R5, 1 - 0","R1, 1 - 0","R2, 0 - 1",null,"R1, 0.5 - 0.5",null,null,"R7, 0 - 1",null,"R1, 0 - 2","R5, 0.5 - 0.5",null,"R2, 0 - 1"]
["h",null,null,null,null,null,"R1, 2 - 0",null,null,null,null,null,null,null,null,null,null,null,null,null,null,null,null,null,null,null,null,null,null,null,null,null,null,null,null,null,null,null,null,null,null,null,null,null,null,null,null,null,null,null,null,null,null,null,null,null,null,null,null,null,null,null,null,null,null,null,null,null,null,null,null,null,null,null,null,null,null,null,null,null,null,null,null,null,null,null,null,null,null,null,null,null,null,null,null,null,null,null,null,null,"R1, 0 - 1","R1, 1 - 0","R1, 0.5 - 0.5","R5, 0 - 1",null,null,"R3, 0 - 1","R7, 0.5 - 0.5",null,"R1, 1 - 0",null,"R4, 0 - 1","R4, 0 - 1","R1, 0 - 1","R2, 1 - 0",null,"R3, 0 - 1",null,"R2, 0.5 - 0.5",null,null,null,"R2, 1 - 0","R4, 19 - 4","R5, 0.5 - 0.5","R2, 0.5 - 0.5",null,"R6, 0.5 - 0.5","R3, 1 - 0"]
["i",null,null,null,null,"R1, 1 - 1",null,null,null,null,null,null,null,null,null,null,null,null,null,null,null,null,null,null,null,null,null,null,null,null,null,null,null,null,null,null,null,null,null,null,null,null,null,null,null,null,null,null,null,null,null,null,null,null,null,null,null,null,null,null,null,null,null,null,null,null,null,null,null,null,null,null,null,null,null,null,null,null,null,null,null,null,null,null,null,null,null,null,null,null,null,null,null,null,null,null,null,null,null,null,"R4, 1 - 0",null,"R1, 0.5 - 0.5","R3, 0 - 1","R1, 1 - 0","R2, 1 - 0","R2, 0.5 - 0.5","R2, 1 - 0","R2, 1 - 0","R1, 0.5 - 0.5","R1, 0.5 - 0.5","R2, 0.5 - 0.5","R5, 0 - 1",null,"R1, 1 - 0","R6, 1 - 0","R6, 0.5 - 0.5",null,null,"R1, 0.5 - 0.5","R2, 0 - 1","R3, 0.5 - 0.5","R1, 0.5 - 0.5","R1, 0.5 - 0.5",null,"R3, 1 - 0","R4, 1 - 0","R5, 0.5 - 0.5","R1, 1 - 0"]
["j",null,null,null,null,null,null,"R1, 2 - 0",null,null,null,null,null,null,null,null,null,null,null,null,null,null,null,null,null,null,null,null,null,null,null,null,null,null,null,null,null,null,null,null,null,null,null,null,null,null,null,null,null,null,null,null,null,null,null,null,null,null,null,null,null,null,null,null,null,null,null,null,null,null,null,null,null,null,null,null,null,null,null,null,null,null,null,null,null,null,null,null,null,null,null,null,null,null,null,null,null,null,null,null,null,"R1, 1 - 0","R1, 1 - 0","R4, 1 - 0","R1, 0 - 1","R2, 1 - 0","R1, 0.5 - 0.5","R6, 0.5 - 0.5","R1, 0 - 1","R3, 1 - 0",null,"R2, 0.5 - 0.5","R2, 0.5 - 0.5","R1, 0.5 - 0.5","R2, 1 - 0","R6, 1 - 0","R7, 0.5 - 0.5","R1, 0.5 - 0.5",null,"R2, 1 - 0",null,null,"R5, 1 - 0","R5, 0 - 1",null,"R1, 0.5 - 0.5","R1, 0 - 1","R1, 0.5 - 0.5","R4, 1 - 0"]
["k",null,null,null,null,null,null,null,null,null,null,null,"R1, 2 - 0",null,null,null,null,null,null,null,null,null,null,null,null,null,null,null,null,null,null,null,null,null,null,null,null,null,null,null,null,null,null,null,null,null,null,null,null,null,null,null,null,null,null,null,null,null,null,null,null,null,null,null,null,null,null,null,null,null,null,null,null,null,null,null,null,null,null,null,null,null,null,null,null,null,null,null,null,null,null,null,null,null,null,null,null,null,null,null,"R1, 1 - 0",null,"R8, 0 - 1","R1, 0.5 - 0.5","R3, 1 - 0","R3, 0 - 1","R3, 0.5 - 0.5","R1, 1 - 0",null,"R2, 0.5 - 0.5","R2, 1 - 0","R1, 1 - 0",null,"R4, 20 - 3","R2, 1 - 0",null,"R2, 1 - 0",null,"R1, 0.5 - 0.5",null,null,"R1, 0.5 - 0.5",null,"R3, 1 - 0","R1, 1 - 0",null,"R1, 0 - 1"]
["l",null,null,null,null,null,null,null,null,null,null,"R1, 0 - 2",null,null,null,null,null,null,null,null,null,null,null,null,null,null,null,null,null,null,null,null,null,null,null,null,null,null,null,null,null,null,null,null,null,null,null,null,null,null,null,null,null,null,null,null,null,null,null,null,null,null,null,null,null,null,null,null,null,null,null,null,null,null,null,null,null,null,null,null,null,null,null,null,null,null,null,null,null,null,null,null,null,null,null,null,null,null,null,null,"R4, 0.5 - 0.5",null,null,"R1, 0.5 - 0.5","R1, 0.5 - 0.5","R1, 0 - 1","R2, 0.5 - 0.5","R4, 0 - 1","R3, 0 - 1","R2, 0 - 1","R3, 0.5 - 0.5","R2, 0.5 - 0.5",null,"R2, 1 - 0","R1, 1 - 1","R8, 0.5 - 0.5","R1, 1 - 0",null,null,"R4, 0 - 1","R2, 0 - 1","R3, 0.5 - 0.5",null,null,"R4, 0 - 1","R5, 0 - 1","R1, 1 - 0","R5, 0 - 1","R1, 1 - 0"]
["m",null,null,null,null,null,null,null,null,null,null,null,null,null,"R1, 0 - 2",null,null,null,null,null,null,null,null,null,null,null,null,null,null,null,null,null,null,null,null,null,null,null,null,null,null,null,null,null,null,null,null,null,null,null,null,null,null,null,null,null,null,null,null,null,null,null,null,null,null,null,null,null,null,null,null,null,null,null,null,null,null,null,null,null,null,null,null,null,null,null,null,null,null,null,null,null,null,null,null,null,null,null,null,null,null,"R2, 0 - 1",null,"R1, 0.5 - 0.5","R4, 0 - 1",null,"R1, 0 - 1","R6, 1 - 0","R2, 1 - 0",null,null,null,"R2, 1 - 0","R2, 6 - 22","R6, 0.5 - 0.5",null,null,"R5, 0.5 - 0.5","R7, 0 - 1","R2, 0 - 1","R1, 1 - 0","R5, 0.5 - 0.5",null,"R1, 0.5 - 0.5","R1, 0.5 - 0.5","R6, 20 - 3","R1, 0 - 1","R1, 0 - 1"]
["n",null,null,null,null,null,null,null,null,null,null,null,null,"R1, 2 - 0",null,null,null,null,null,null,null,null,null,null,null,null,null,null,null,null,null,null,null,null,null,null,null,null,null,null,null,null,null,null,null,null,null,null,null,null,null,null,null,null,null,null,null,null,null,null,null,null,null,null,null,null,null,null,null,null,null,null,null,null,null,null,null,null,null,null,null,null,null,null,null,null,null,null,null,null,null,null,null,null,null,null,null,null,null,null,"R1, 0 - 1","R1, 0.5 - 0.5","R1, 2 - 0",null,null,"R3, 0.5 - 0.5","R2, 1 - 0",null,"R3, 1 - 0","R1, 0 - 1","R1, 0.5 - 0.5",null,"R2, 1 - 0","R1, 0.5 - 0.5","R3, 0.5 - 0.5","R1, 1 - 0",null,"R2, 0.5 - 0.5","R2, 0 - 1","R6, 0 - 1",null,"R1, 0.5 - 0.5",null,"R4, 0 - 1",null,"R1, 0.5 - 0.5","R3, 1 - 0","R8, 0 - 1"]
{"$rows_left_out":115}
{"sheet":"Round1","index":10,"n_rows":15,"n_cols":23,"rows_kept":15,"cut":false,"hidden":false,"merged":[]}
["Swaps: 0","Home Player","Away Player","Home Points","Away Points","Home TD","Away TD","Home Cas","Away Cas","Home Bonus1","Away Bonus1","Home Bonus2","Away Bonus2","Home Group","Away Group",null,null,null,"Points Before Games",null,null,"Points After Games"]
[null,"d","b",{"$f":"fctScore(F2,G2,H2,J2,L2)","v":1},{"$f":"fctScore(G2,F2,I2,K2,M2)","v":1},2,2,2,1,1,2,0,2,null,null,null,null,null,"d",0,null,"d",2]
[null,"a","c",{"$f":"fctScore(F3,G3,H3,J3,L3)","v":1},{"$f":"fctScore(G3,F3,I3,K3,M3)","v":1},2,2,0,1,3,2,1,3,null,null,null,null,null,"b",0,null,"c",2]
[null,"n","m",2,0,3,0,3,1,2,2,0,2,null,null,null,null,null,"a",0,null,"b",2]
[null,"i","e",1,1,1,1,2,2,1,1,2,2,null,null,null,null,null,"c",0,null,"a",2]
[null,"l","k",0,2,2,3,3,1,2,3,1,2,null,null,null,null,null,"n",0,null,"n",2]
[null,"f","h",0,2,0,3,2,0,2,0,0,2,null,null,null,null,null,"m",0,null,"h",2]
[null,"j","g",2,0,1,0,1,1,1,3,3,1,null,null,null,null,null,"i",0,null,"k",2]
[null,null,null,null,null,null,null,null,null,null,null,null,null,null,null,null,null,null,"e",0,null,"e",1]
[null,null,null,null,null,null,null,null,null,null,null,null,null,null,null,null,null,null,"l",0,null,"i",1]
[null,null,null,null,null,null,null,null,null,null,null,null,null,null,null,null,null,null,"k",0,null,"l",0]
[null,null,null,null,null,null,null,null,null,null,null,null,null,null,null,null,null,null,"f",0,null,"f",0]
[null,null,null,null,null,null,null,null,null,null,null,null,null,null,null,null,null,null,"h",0,null,"m",0]
[null,null,null,null,null,null,null,null,null,null,null,null,null,null,null,null,null,null,"j",0,null,"j",-98]
[null,null,null,null,null,null,null,null,null,null,null,null,null,null,null,null,null,null,"g",0,null,"g",-100]
{"$rows_left_out":1}
{"sheet":"Round2","index":11,"n_rows":0,"n_cols":0,"rows_kept":0,"cut":false,"hidden":false,"merged":[]}

{"sheet":"Round3","index":12,"n_rows":0,"n_cols":0,"rows_kept":0,"cut":false,"hidden":false,"merged":[]}

{"sheet":"Round4","index":13,"n_rows":0,"n_cols":0,"rows_kept":0,"cut":false,"hidden":false,"merged":[]}

{"sheet":"Round5","index":14,"n_rows":0,"n_cols":0,"rows_kept":0,"cut":false,"hidden":false,"merged":[]}

{"sheet":"Round6","index":15,"n_rows":0,"n_cols":0,"rows_kept":0,"cut":false,"hidden":false,"merged":[]}

{"sheet":"Round7","index":16,"n_rows":0,"n_cols":0,"rows_kept":0,"cut":false,"hidden":false,"merged":[]}

{"sheet":"Round8","index":17,"n_rows":0,"n_cols":0,"rows_kept":0,"cut":false,"hidden":false,"merged":[]}

{"sheet":"Round9","index":18,"n_rows":0,"n_cols":0,"rows_kept":0,"cut":false,"hidden":false,"merged":[]}

{"sheet":"NAF","index":19,"n_rows":861,"n_cols":1,"rows_kept":861,"cut":false,"hidden":false,"merged":[]}
["<?xml version=\"1.0\" encoding=\"UTF-8\"?>"]
["<nafReport xmlns:blo=\"http://www.bloodbowl.net\">"]
["<organiser>Mike</organiser>"]
["<coaches>"]
["<coach>"]
["<name>Alex</name>"]
["<number>16761</number>"]
["<team>Skaven</team>"]
["</coach>"]
["<coach>"]
["<name>Mike</name>"]
["<number>10468</number>"]
["<team>Elves</team>"]
["</coach>"]
["<coach>"]
{"$rows_left_out":847}
{"sheet":"Working","index":20,"n_rows":40,"n_cols":34,"rows_kept":40,"cut":false,"hidden":false,"merged":[]}
[null,null,null,null,null,null,null,null,null,null,null,null,null,null,null,null,null,null,null,null,null,null,null,null,null,"Latest Rd:",1]
[null,null,null,null,null,null,null,null,null,null,null,null,null,null,null,null,null,null,null,null,null,null,null,null,null,"Players:",{"$f":"COUNTA(Players!B:B)-1","v":14},null,null,null,"Max Score",{"$f":"Setup!B19*TeamSize*Setup!B19+Setup!B19","v":18}]
[null,null,null,null,null,null,null,null,null,null,null,null,null,null,null,null,null,null,null,null,null,null,null,null,null,"Display",14,"Columns"]
[null,null,null,null,null,null,null,null,null,null,null,null,null,null,null,null,null,null,null,null,null,null,null,null,null,"Enter",7,"Columns"]
[null,null,null,null,null,null,null,null,null,null,null,null,null,null,null,null,null,null,null,null,null,null,null,null,null,"Max random",3]
[null,null,null,null,null,null,null,null,null,null,null,null,null,null,null,null,null,null,null,null,null,null,null,null,null,"Number of Groups",{"$f":"COUNTA(Players!M:M)-1","v":8},null,null,null,"Group"]
[null,null,null,null,null,null,null,null,null,null,null,null,null,null,null,null,null,null,null,null,null,null,null,null,null,null,null,null,null,null,"Individual"]
[null,null,null,null,null,null,null,null,null,null,null,null,null,null,null,null,null,null,null,null,null,null,null,null,null,"Group display",18,"columns"]
[]
[null,null,null,null,null,null,null,null,null,null,null,null,null,null,null,null,null,null,null,null,null,null,null,null,null,null,null,null,"Cumulative"]
[null,null,null,null,null,null,null,null,null,null,null,null,null,null,null,null,null,null,null,null,null,null,null,null,null,null,"Amazon",null,null,null,null,null,"Entry Data"]
[null,null,null,null,null,null,null,null,null,null,null,null,null,null,null,null,null,null,null,null,null,null,null,null,null,null,"Black Orc",null,null,null,"Initial Display Columns",null,"Player"]
[null,null,null,null,null,null,null,null,null,null,null,null,null,null,null,null,null,null,null,null,null,null,null,null,null,null,"Bretonnian",null,null,null,"Player",null,"Points"]
[null,null,null,null,null,null,null,null,null,null,null,null,null,null,null,null,null,null,null,null,null,null,null,null,null,null,"Chaos Chosen",null,null,null,"Points",null,"TD"]
[null,null,null,null,null,null,null,null,null,null,null,null,null,null,null,null,null,null,null,null,null,null,null,null,null,null,"Chaos Dwarf",null,null,null,"TD For",null,"Cas"]
{"$rows_left_out":26}
{"sheet":"ChangeLog","index":21,"n_rows":37,"n_cols":4,"rows_kept":37,"cut":false,"hidden":false,"merged":[]}
[null,"This spreadsheet is based on one by Kaper on an Excel forum: http://www.excelforum.com/excel-programming-vba-macros/1105569-swiss-pairing-algorithm-in-excel-to-organize-a-chess-tournament.html"]
[null,"Massive thanks due to him!"]
[null,"The original was used for Chess, and it has been adapted to work for Blood Bowl by sann0638 (Mike Davies)"]
[]
["Version","Summary","Date","Notes"]
["1.0","Multi-sheet version of the chess","2016-06-19"]
[1.1000000000000001,"Remove Black and White stuff","2016-06-19"]
[1.2,"Change to TDs to generate points","2016-06-19"]
[null,"Got the Swiss working properly","2016-06-19","Published."]
[1.3,"More help information.","2016-06-20"]
[null,"Added Table","2016-06-20"]
[null,"Added Opponent Score","2016-06-20"]
[2.1,"Big overhaul to where info stored","2016-06-21"]
[2.2000000000000002,"Putting in the Score formula","2016-06-21","Published."]
[3.1,"Added all tiebreaker columns","2016-06-22"]
{"$rows_left_out":22}