{"text_format":"1","workbook":"xlsx","n_sheets":22,"sheets":["Intro","Setup","Players","Table","Stunty","GroupFixtures","GroupTable","Presentation","GroupMatrix","Matrix","Round1","Round2","Round3","Round4","Round5","Round6","Round7","Round8","Round9","NAF","Working","ChangeLog"],"not_rendered":{"charts":0,"images":0,"macros":1,"external_links":0,"defined_names":35,"comments":2,"pivot_tables":0},"unopened":[],"bounds":{"document_bytes":16777216,"sheet_cells":100000,"rows_first":2000,"rows_last":500,"rows_between":2000,"halvings":0,"cell_chars":16384,"cell_head_chars":4096},"cells_cut":0,"cells_raw":0,"read":"whole","date_system":"1900"}

{"sheet":"Intro","index":0,"n_rows":19,"n_cols":18,"rows_kept":19,"cut":false,"hidden":false,"merged":[]}
[]
[null,"Buttons for running a tournament:",null,null,null,null,null,null,null,null,null,null,null,null,null,null,null,"Setup Tabs"]
[null,null,null,null,null,null,null,null,null,null,null,null,null,null,null,null,null,"Presentation Tabs"]
[null,null,null,null,null,null,null,null,null,null,null,null,null,null,null,null,null,"Round Results"]
[null,null,null,null,null,null,null,null,null,null,null,null,null,null,null,null,null,"Other"]
[]
[]
[]
{"$rows_left_out":12}
{"sheet":"Setup","index":1,"n_rows":24,"n_cols":11,"rows_kept":24,"cut":false,"hidden":false,"merged":[]}
["SCORING SETUP",null,null,"Group/Ind Swiss?","Group",null,"Individual Tie Breaks",null,null,"Group Tie Breaks"]
[null,null,null,null,null,null,"Player",null,null,"Group"]
["Points for…",null,null,"Name of First Bonus","Bonus1",null,"Points","Order",null,"Points","Order"]
["Win by at least 2 TD",2,null,"Name of Second Bonus","Bonus2",null,"TD For",null,null,"TD For"]
["Win by 1 TD",2,null,null,null,null,"TD Against",null,null,"TD Against"]
["Draw",1,null,null,null,null,"TD Net",2,null,"Net TDs",2]
["Lose by 1 TD",0,null,null,null,null,"Cas For",null,null,"Cas For"]
["Lose by at least 2 TD",0,null,null,null,null,"Cas Against",null,null,"Cas Against"]
{"$rows_left_out":17}
{"sheet":"Players","index":2,"n_rows":160,"n_cols":16,"rows_kept":160,"cut":false,"hidden":false,"merged":[]}
["Num","Display Name","NAF Name","NAF Number (Random)","Race","Group","Stunty",null,null,null,null,null,"Groups",null,"Team Size",8]
[{"$f":"IF(C2=\"\",\"\",MAX(A$1:A1)+1)","v":1},"Niebling ","Niebling ",11499,"Amazons","Denmark",null,null,null,null,null,null,"Belgium"]
[{"$f":"IF(C3=\"\",\"\",MAX(A$1:A2)+1)","v":2},"PurpleGoo ","PurpleGoo ",11777,"Amazons","England",null,null,null,null,null,null,"Denmark"]
[{"$f":"IF(C4=\"\",\"\",MAX(A$1:A3)+1)","v":3},"Mubo ","Mubo ",13409,"Amazons","England",null,null,null,null,null,null,"England"]
[{"$f":"IF(B5=\"\",\"\",MAX(A$1:A4)+1)","v":4},"Dirold ","Dirold ",5900,"Amazons","Italy",null,null,null,null,null,null,"Finland"]
[{"$f":"IF(B6=\"\",\"\",MAX(A$1:A5)+1)","v":5},"The_Ref ","The_Ref ",9441,"Amazons","Norway",null,null,null,null,null,null,"France"]
[{"$f":"IF(C7=\"\",\"\",MAX(A$1:A6)+1)","v":6},"Tripleskull ","Tripleskull ",9524,"Chaos","Denmark",null,null,null,null,null,null,"Germany"]
[{"$f":"IF(C8=\"\",\"\",MAX(A$1:A7)+1)","v":7},"MissSweden ","MissSweden ",11498,"Chaos","Denmark",null,null,null,null,null,null,"Hungary"]
{"$rows_left_out":153}
{"sheet":"Table","index":3,"n_rows":129,"n_cols":16,"rows_kept":129,"cut":false,"hidden":false,"merged":[]}
["Player","Points","TD For","TD Against","TD Net","Cas For","Cas Against","Cas Net","Bonus1","Bonus2","Wins","Draws","Losses","Opp Score",null,"Group"]
["Gros Nain ",2,3,0,3,3,1,2,2,0,1,null,null,0,null,"France"]
["Topper ",2,3,0,3,3,2,1,2,2,1,null,null,0,null,"Denmark"]
["Geggster ",2,3,0,3,2,2,0,0,0,1,null,null,0,null,"England"]
["SpecialOne ",2,3,0,3,1,2,-1,1,1,1,null,null,0,null,"Denmark"]
["Loki ",2,3,0,3,0,2,-2,0,2,1,null,null,0,null,"Scotland"]
["swifty ",2,3,1,2,1,0,1,1,1,1,null,null,0,null,"Hungary"]
["BlackOrc ",2,2,0,2,2,1,1,2,1,1,null,null,0,null,"Hungary"]
{"$rows_left_out":122}
{"sheet":"Stunty","index":4,"n_rows":12,"n_cols":16,"rows_kept":12,"cut":false,"hidden":false,"merged":[]}
["Player","Points","TD For","TD Against","TD Net","Cas For","Cas Against","Cas Net","Bonus1","Bonus2","Wins","Draws","Losses","Opp Score","Race","Group"]
["Mufflo ",2,3,1,2,0,0,0,1,0,1,null,null,0,"Ogres","Viking"]
["Domingo ",2,3,1,2,1,3,-2,2,1,1,null,null,0,"Ogres","Poland"]
["JohnnyD ",1,1,1,0,2,1,1,1,2,null,1,null,1,"Halflings","Sweden"]
["Strider84 ",0,2,3,-1,2,0,2,1,1,null,null,1,2,"Goblins","Switzerland"]
["Araznaroth ",0,2,3,-1,2,1,1,2,2,null,null,1,2,"Goblins","Belgium"]
["Phifoe ",0,1,2,-1,1,1,0,1,1,null,null,1,2,"Goblins","Switzerland"]
["JimJimany ",0,1,2,-1,1,1,0,0,1,null,null,1,2,"Goblins","England"]
{"$rows_left_out":5}
{"sheet":"GroupFixtures","index":5,"n_rows":17,"n_cols":14,"rows_kept":17,"cut":false,"hidden":false,"merged":[]}
["Round: 2",null,"Home","Away",null,null,null,null,null,null,null,null,"Points Before Games"]
["Swaps: 0",null,"Germany","Denmark",null,null,null,null,null,null,null,null,"Germany",213]
[null,null,"Viking","Hungary",null,null,null,null,null,null,null,null,"Denmark",212]
[null,null,"England","Finland",null,null,null,null,null,null,null,null,"Viking",210]
[null,null,"France","Poland",null,null,null,null,null,null,null,null,"Hungary",209]
[null,null,"Italy","Scotland",null,null,null,null,null,null,null,null,"England",209]
[null,null,"Wales","Belgium",null,null,null,null,null,null,null,null,"Finland",209]
[null,null,"Spain","Sweden",null,null,null,null,null,null,null,null,"France",209]
{"$rows_left_out":10}
{"sheet":"GroupTable","index":6,"n_rows":17,"n_cols":18,"rows_kept":17,"cut":false,"hidden":false,"merged":[]}
["Group","Points","TD For","TD Against","Net TDs","Cas For","Cas Against","Net Cas","Group Total Bonus1","Group Total Bonus2","Group Wins","Groups Draws","Group Losses","Individual Wins","Individual Draws","Individual Losses","Total Individual Points","Opponent Score"]
["Germany",213,15,10,5,13,10,3,13,7,1,null,null,6,1,1,13,3]
["Denmark",212,18,8,10,9,15,-6,11,12,1,null,null,6,null,2,12,4]
["Viking",210,12,9,3,14,9,5,13,12,1,null,null,3,4,1,10,6]
["Hungary",209,13,10,3,12,11,1,13,7,1,null,null,3,3,2,9,7]
["England",209,11,8,3,10,11,-1,7,13,1,null,null,4,1,3,9,7]
["Finland",209,13,11,2,12,15,-3,11,15,1,null,null,3,3,2,9,7]
["France",209,12,11,1,13,9,4,13,9,1,null,null,3,3,2,9,7]
{"$rows_left_out":10}
{"sheet":"Presentation","index":7,"n_rows":183,"n_cols":9,"rows_kept":183,"cut":false,"hidden":false,"merged":[]}
["Round",1]
[]
["Board","Home","Away","Home Team","Away Team","Home TD","Away TD","Home Cas","Away Cas"]
[1,{"$f":"IF(A4=\"\",\"\",OFFSET(INDIRECT(\"Round\"&Round&\"!B1\"),$A4,0))","v":"Harti "},{"$f":"IF(A4=\"\",\"\",OFFSET(INDIRECT(\"Round\"&Round&\"!c1\"),$A4,0))","v":"sann0638 "},{"$f":"IF(A4=\"\",\"\",OFFSET(INDIRECT(\"Round\"&Round&\"!n1\"),$A4,0))","v":"France"},{"$f":"IF(A4=\"\",\"\",OFFSET(INDIRECT(\"Round\"&Round&\"!o1\"),$A4,0))","v":"Scotland"}]
[{"$f":"IF(A4=\"\",A3+1,IF(ROUNDUP(A4/8,0)=A4/8,\"\",A4+1))","v":2},{"$f":"IF(A5=\"\",\"\",OFFSET(INDIRECT(\"Round\"&Round&\"!B1\"),$A5,0))","v":"BiBi "},{"$f":"IF(A5=\"\",\"\",OFFSET(INDIRECT(\"Round\"&Round&\"!c1\"),$A5,0))","v":"Garrick "},{"$f":"IF(A5=\"\",\"\",OFFSET(INDIRECT(\"Round\"&Round&\"!n1\"),$A5,0))","v":"France"},{"$f":"IF(A5=\"\",\"\",OFFSET(INDIRECT(\"Round\"&Round&\"!o1\"),$A5,0))","v":"Scotland"}]
[{"$f":"IF(A5=\"\",A4+1,IF(ROUNDUP(A5/8,0)=A5/8,\"\",A5+1))","v":3},{"$f":"IF(A6=\"\",\"\",OFFSET(INDIRECT(\"Round\"&Round&\"!B1\"),$A6,0))","v":"Gros Nain "},{"$f":"IF(A6=\"\",\"\",OFFSET(INDIRECT(\"Round\"&Round&\"!c1\"),$A6,0))","v":"HumptyTrump "},{"$f":"IF(A6=\"\",\"\",OFFSET(INDIRECT(\"Round\"&Round&\"!n1\"),$A6,0))","v":"France"},{"$f":"IF(A6=\"\",\"\",OFFSET(INDIRECT(\"Round\"&Round&\"!o1\"),$A6,0))","v":"Scotland"}]
[4,{"$f":"IF(A7=\"\",\"\",OFFSET(INDIRECT(\"Round\"&Round&\"!B1\"),$A7,0))","v":"Justicium "},{"$f":"IF(A7=\"\",\"\",OFFSET(INDIRECT(\"Round\"&Round&\"!c1\"),$A7,0))","v":"DonShula "},{"$f":"IF(A7=\"\",\"\",OFFSET(INDIRECT(\"Round\"&Round&\"!n1\"),$A7,0))","v":"France"},{"$f":"IF(A7=\"\",\"\",OFFSET(INDIRECT(\"Round\"&Round&\"!o1\"),$A7,0))","v":"Scotland"}]
[5,{"$f":"IF(A8=\"\",\"\",OFFSET(INDIRECT(\"Round\"&Round&\"!B1\"),$A8,0))","v":"BudWiser "},{"$f":"IF(A8=\"\",\"\",OFFSET(INDIRECT(\"Round\"&Round&\"!c1\"),$A8,0))","v":"Purdindas "},{"$f":"IF(A8=\"\",\"\",OFFSET(INDIRECT(\"Round\"&Round&\"!n1\"),$A8,0))","v":"France"},{"$f":"IF(A8=\"\",\"\",OFFSET(INDIRECT(\"Round\"&Round&\"!o1\"),$A8,0))","v":"Scotland"}]
{"$rows_left_out":176}
{"sheet":"GroupMatrix","index":8,"n_rows":17,"n_cols":17,"rows_kept":17,"cut":false,"hidden":false,"merged":[]}
[null,"Belgium","Denmark","England","Finland","France","Germany","Hungary","Italy","Norway","Poland","Scotland","Spain","Sweden","Switzerland","Viking","Wales"]
["Belgium",null,null,"Rd 1 - 7"]
["Denmark",null,null,null,null,null,null,null,null,"Rd 1 - 212"]
["England","Rd 1 - 209"]
["Finland",null,null,null,null,null,null,null,null,null,null,null,null,null,null,null,"Rd 1 - 209"]
["France",null,null,null,null,null,null,null,null,null,null,"Rd 1 - 209"]
["Germany",null,null,null,null,null,null,null,null,null,null,null,null,null,"Rd 1 - 213"]
["Hungary",null,null,null,null,null,null,null,null,null,null,null,"Rd 1 - 209"]
{"$rows_left_out":10}
{"sheet":"Matrix","index":9,"n_rows":129,"n_cols":129,"rows_kept":129,"cut":false,"hidden":false,"merged":[]}
[null,"Niebling ","PurpleGoo ","Mubo ","Dirold ","The_Ref ","Tripleskull ","MissSweden ","Topper ","Joemanji ","edheim ","FrankPedersen ","Obeliz ","Northernknight ","Woete ","RoterSternHochdahl","Jonny_Kanone ","Itzla ","Farina ","Garrick ","Dark Duke ","20Phoenix ","Malodoror ","Bouzzy ","DocMaxx ","BlackOrc ","Kaltenland ","Shawass ","Malasnoticias ","Macabeo ","Corwin ","SFisher91 ","Phoenix11 ","Wolio ","Reszka ","Slimaq ","Skuld ","Balder ","Dionysian ","Harza ","Idroj ","Faccko ","MacWitt ","Pellevin ","Araznaroth ","JimJimany ","zulu ","mynock ","Strider84 ","Phifoe ","JohnnyD ","Dekra1979 ","straume ","Barry ","Tactel ","Pidpad ","Elrik ","Simon_ACP ","sann0638 ","Goss ","Muadib ","swifty ","Matte8 ","Joanet ","SpecialOne ","Prince ","GreatWhiteHope ","Bernuz ","MadeofWelsh ","Tank ","BeerBeer ","ratogre ","BudWiser ","Gros Nain ","Warrior1980 ","Juniooor7 ","Madmatt13 ","jopotzuki ","J-Ho","Verrinho ","Valen ","Lycos ","Domingo ","Mufflo ","andydavo ","Geggster ","Arioso ","Gaunab ","Alex05 ","Beppe ","Melisqus ","Dragons ","Jaqra ","Harti ","Favi ","Spartako ","DonShula ","HumptyTrump ","Purrelito ","nonumber ","Driesfield ","kfoged ","Podfrey ","valkohukka ","Skoberget ","brocCooli ","Ploppy_McPloppy ","BiBi ","Matt le fou ","Candlejack ","Purdindas ","JJ ","Wilzif ","noraal ","cz ","Loki ","gninocker ","Mewash ","Leonek ","JamesEs ","Duke_Luthor_Von_Hawkfire ","Jokaero ","Duckwing ","Justicium ","Liam ","Endalos ","bothun ","Inforthepain ","sigu70 "]
["Niebling ",null,null,null,null,null,null,null,null,null,null,"R1, 2 - 0",null,null,null,null,null,null,null,null,null,null,null,null,null,null,null,null,null,null,null,null,null,null,null,null,null,null,null,null,null,null,null,null,null,null,null,null,null,null,null,null,null,null,null,null,null,null,null,null,null,null,null,null,null,null,null,null,null,null,null,null,null,null,null,null,null,null,null,null,null,null,null,null,null,null,null,null,null,null,null,null,null,null,null,null,null,null,null,null,"R1, 1 - 0","R5, 1 - 0","R1, 1 - 0","R3, 0 - 1",null,"R4, 1 - 0","R6, 1 - 0",null,"R1, 0.5 - 0.5","R4, 4 - 18","R2, 0 - 1",null,"R4, 1 - 0",null,"R5, 0 - 1","R7, 0.5 - 0.5","R1, 1 - 0","R8, 1 - 0","R3, 0 - 1","R3, 1 - 0","R3, 23 - 5",null,"R3, 0 - 1",null,"R1, 0 - 1",null,null,"R3, 1 - 0","R5, 1 - 0"]
["PurpleGoo ",null,null,null,null,null,null,null,null,null,null,null,null,null,null,null,null,null,null,null,null,null,null,null,null,null,null,null,null,null,null,null,null,null,null,null,null,null,null,null,null,null,null,null,null,null,null,null,null,null,null,null,null,null,null,null,null,null,null,null,null,null,null,null,null,null,null,null,null,null,null,null,null,null,null,null,null,null,null,null,null,null,null,null,null,null,null,null,null,null,null,null,null,null,null,null,null,null,null,null,null,"R1, 0.5 - 0.5",null,"R4, 0.5 - 0.5","R5, 0.5 - 0.5","R2, 0 - 1","R1, 1 - 0",null,null,"R4, 0.5 - 0.5",null,"R3, 1 - 0",null,"R1, 0.5 - 0.5",null,"R3, 0.5 - 0.5","R1, 2 - 0",null,null,null,"R1, 1 - 0","R3, 0 - 1","R5, 1 - 0",null,null,"R4, 5 - 22","R6, 0 - 1"]
["Mubo ",null,null,null,null,null,null,null,null,null,null,null,null,null,null,null,null,null,null,null,null,null,null,null,null,null,null,null,null,null,null,null,null,null,null,null,null,null,null,null,null,null,null,null,"R1, 2 - 0",null,null,null,null,null,null,null,null,null,null,null,null,null,null,null,null,null,null,null,null,null,null,null,null,null,null,null,null,null,null,null,null,null,null,null,null,null,null,null,null,null,null,null,null,null,null,null,null,null,null,null,null,null,null,null,"R1, 0.5 - 0.5","R4, 0.5 - 0.5","R1, 0 - 1","R2, 0.5 - 0.5",null,"R3, 0 - 1","R3, 1 - 0","R4, 0 - 1","R4, 0.5 - 0.5","R5, 3 - 20","R4, 0 - 1",null,null,"R5, 0 - 1","R6, 1 - 0","R6, 1 - 0","R1, 1 - 0","R3, 1 - 0","R2, 0 - 1","R1, 0.5 - 0.5","R2, 0 - 1",null,null,"R2, 0 - 1","R2, 22 - 6","R5, 0.5 - 0.5","R5, 1 - 0","R2, 0 - 1"]
["Dirold ",null,null,null,null,null,null,null,null,null,null,null,null,null,null,null,null,null,null,null,null,null,null,null,null,null,null,null,null,null,null,null,null,null,"R1, 1 - 1",null,null,null,null,null,null,null,null,null,null,null,null,null,null,null,null,null,null,null,null,null,null,null,null,null,null,null,null,null,null,null,null,null,null,null,null,null,null,null,null,null,null,null,null,null,null,null,null,null,null,null,null,null,null,null,null,null,null,null,null,null,null,null,null,null,"R4, 0 - 1","R5, 0.5 - 0.5","R1, 0 - 1","R1, 1 - 0","R1, 0.5 - 0.5","R2, 0 - 1","R4, 0.5 - 0.5","R3, 0.5 - 0.5","R7, 1 - 0",null,null,"R6, 0 - 1","R1, 0 - 1","R3, 0.5 - 0.5","R6, 0.5 - 0.5","R4, 0.5 - 0.5","R1, 1 - 0","R4, 0.5 - 0.5",null,"R2, 1 - 0","R1, 0.5 - 0.5","R3, 0 - 1",null,"R3, 21 - 4","R2, 0 - 1","R6, 0.5 - 0.5",null,"R3, 1 - 0","R6, 19 - 3"]
["The_Ref ",null,null,null,null,null,null,null,null,null,null,null,null,null,null,null,null,null,null,null,null,null,null,null,null,null,null,null,null,null,null,null,null,null,null,null,null,null,null,null,null,null,null,null,null,null,null,null,null,null,null,null,null,null,null,null,null,null,null,null,null,null,null,null,"R1, 0 - 2",null,null,null,null,null,null,null,null,null,null,null,null,null,null,null,null,null,null,null,null,null,null,null,null,null,null,null,null,null,null,null,null,null,null,null,null,null,"R5, 0 - 1","R2, 1 - 0","R1, 0.5 - 0.5","R2, 0.5 - 0.5",null,"R1, 0 - 1","R4, 1 - 0","R5, 1 - 0","R4, 0 - 1","R1, 0 - 1","R5, 0 - 1","R3, 0.5 - 0.5","R1, 0 - 1","R1, 0.5 - 0.5",null,null,"R5, 0 - 1","R1, 0.5 - 0.5",null,null,"R6, 1 - 0","R3, 1 - 0",null,null,"R2, 1 - 0",null,"R6, 0 - 1"]
["Tripleskull ",null,null,null,null,null,null,null,null,null,null,null,null,null,null,null,null,null,null,null,null,null,null,null,null,null,null,null,null,null,null,null,null,null,null,null,null,null,null,null,null,null,null,null,null,null,null,null,null,null,null,null,null,null,null,null,null,null,null,null,null,null,null,null,null,null,"R1, 2 - 0",null,null,null,null,null,null,null,null,null,null,null,null,null,null,null,null,null,null,null,null,null,null,null,null,null,null,null,null,null,null,null,null,null,"R5, 1 - 0","R1, 0 - 1","R5, 0.5 - 0.5","R4, 0 - 1","R6, 0.5 - 0.5",null,"R4, 0.5 - 0.5",null,"R4, 0.5 - 0.5","R6, 0.5 - 0.5","R1, 0.5 - 0.5","R3, 1 - 0","R3, 1 - 0","R6, 0.5 - 0.5","R3, 0.5 - 0.5","R2, 1 - 0","R2, 1 - 0","R3, 0.5 - 0.5","R1, 1 - 0","R7, 1 - 0","R3, 1 - 0","R5, 0.5 - 0.5",null,null,"R3, 1 - 0","R2, 1 - 0","R5, 0 - 1"]
["MissSweden ",null,null,null,null,null,null,null,null,null,null,null,null,null,null,null,null,null,null,null,null,null,null,null,null,null,null,null,null,null,null,null,null,null,null,null,null,null,null,null,null,null,null,null,null,null,null,null,null,null,null,null,null,null,null,null,null,null,null,null,null,null,null,null,null,null,null,null,null,null,null,null,null,null,null,null,null,null,null,null,null,null,null,null,null,null,null,null,null,null,null,null,null,null,null,null,null,null,null,null,"R1, 1 - 0",null,"R4, 0 - 1","R1, 1 - 0","R3, 1 - 0","R1, 1 - 0",null,"R5, 0.5 - 0.5",null,"R3, 0 - 1","R7, 0 - 1","R4, 1 - 0",null,"R2, 1 - 0",null,"R1, 0 - 1","R5, 1 - 0","R1, 1 - 0","R2, 0 - 1",null,"R1, 0.5 - 0.5",null,null,"R7, 0 - 1",null,"R1, 0 - 2","R5, 0.5 - 0.5",null,"R2, 0 - 1"]
{"$rows_left_out":122}
{"sheet":"Round1","index":10,"n_rows":129,"n_cols":33,"rows_kept":129,"cut":false,"hidden":false,"merged":[]}
[null,"Home Player","Away Player","Home Points","Away Points","Home TD","Away TD","Home Cas","Away Cas","Home Bonus1","Away Bonus1","Home Bonus2","Away Bonus2","Home Group","Away Group",null,null,null,"Points Before Games",null,null,"Points After Games",null,null,"Group Results","Group","Points",null,"Group Points Before Games",null,null,"Group Points After Games"]
[null,"Harti ","sann0638 ",{"$f":"fctScore(F2,G2,H2,J2,L2)","v":1},{"$f":"fctScore(G2,F2,I2,K2,M2)","v":1},2,2,2,1,1,2,0,2,"France","Scotland",null,null,null,"Wilzif ",0,null,"Gros Nain ",2,null,null,"Belgium",7,null,"France",0,null,"Germany",213]
[null,"BiBi ","Garrick ",{"$f":"fctScore(F3,G3,H3,J3,L3)","v":1},{"$f":"fctScore(G3,F3,I3,K3,M3)","v":1},2,2,0,1,3,2,1,3,"France","Scotland",null,null,null,"sann0638 ",0,null,"Topper ",2,null,null,"Denmark",212,null,"Scotland",0,null,"Denmark",212]
[null,"Gros Nain ","HumptyTrump ",2,0,3,0,3,1,2,2,0,2,"France","Scotland",null,null,null,"sigu70 ",0,null,"Geggster ",2,null,null,"England",209,null,"Spain",0,null,"Viking",210]
[null,"Justicium ","DonShula ",1,1,1,1,2,2,1,1,2,2,"France","Scotland",null,null,null,"Strider84 ",0,null,"SpecialOne ",2,null,null,"Finland",209,null,"Hungary",0,null,"Hungary",209]
[null,"BudWiser ","Purdindas ",0,2,2,3,3,1,2,3,1,2,"France","Scotland",null,null,null,"Pellevin ",0,null,"Loki ",2,null,null,"France",209,null,"Germany",0,null,"England",209]
[null,"Simon_ACP ","Loki ",0,2,0,3,2,0,2,0,0,2,"France","Scotland",null,null,null,"JohnnyD ",0,null,"swifty ",2,null,null,"Germany",213,null,"Switzerland",0,null,"Finland",209]
[null,"Bouzzy ","Valen ",2,0,1,0,1,1,1,3,3,1,"France","Scotland",null,null,null,"Slimaq ",0,null,"BlackOrc ",2,null,null,"Hungary",209,null,"Sweden",0,null,"France",209]
{"$rows_left_out":122}
{"sheet":"Round2","index":11,"n_rows":129,"n_cols":30,"rows_kept":129,"cut":false,"hidden":false,"merged":[]}
[null,"Home Player","Away Player","Home Points","Away Points","Home TD","Away TD","Home Cas","Away Cas","Home Bonus1","Away Bonus1","Home Bonus2","Away Bonus2","Home Group","Away Group",null,null,null,"Points Before Games",null,null,null,null,null,null,null,null,null,"Group Points Before Games"]
[null,"Candlejack ","Topper ",{"$f":"fctScore(F2,G2,H2,J2,L2)","v":1},{"$f":"fctScore(G2,F2,I2,K2,M2)","v":1},2,2,2,0,1,1,0,0,"Germany","Denmark",null,null,null,"Gros Nain ",2,null,null,null,null,null,null,null,null,"Germany",213]
[null,"Muadib ","SpecialOne ",{"$f":"fctScore(F3,G3,H3,J3,L3)","v":0},{"$f":"fctScore(G3,F3,I3,K3,M3)","v":2},1,2,2,2,0,1,0,1,"Germany","Denmark",null,null,null,"Topper ",2,null,null,null,null,null,null,null,null,"Denmark",212]
[null,"DocMaxx ","Tank ",1,1,2,2,2,1,3,2,2,1,"Germany","Denmark",null,null,null,"Geggster ",2,null,null,null,null,null,null,null,null,"Viking",210]
[null,"RoterSternHochdahl","Niebling ",2,0,2,0,0,1,2,3,1,2,"Germany","Denmark",null,null,null,"SpecialOne ",2,null,null,null,null,null,null,null,null,"Hungary",209]
[null,"Gaunab ","Tripleskull ",2,0,2,0,2,1,1,2,3,3,"Germany","Denmark",null,null,null,"Loki ",2,null,null,null,null,null,null,null,null,"England",209]
[null,"Prince ","Jaqra ",2,0,2,0,2,3,0,3,0,1,"Germany","Denmark",null,null,null,"swifty ",2,null,null,null,null,null,null,null,null,"Finland",209]
[null,"Jonny_Kanone ","kfoged ",1,1,2,2,0,0,2,1,1,2,"Germany","Denmark",null,null,null,"BlackOrc ",2,null,null,null,null,null,null,null,null,"France",209]
{"$rows_left_out":122}
{"sheet":"Round3","index":12,"n_rows":0,"n_cols":0,"rows_kept":0,"cut":false,"hidden":false,"merged":[]}

{"sheet":"Round4","index":13,"n_rows":0,"n_cols":0,"rows_kept":0,"cut":false,"hidden":false,"merged":[]}

{"sheet":"Round5","index":14,"n_rows":0,"n_cols":0,"rows_kept":0,"cut":false,"hidden":false,"merged":[]}

{"sheet":"Round6","index":15,"n_rows":0,"n_cols":0,"rows_kept":0,"cut":false,"hidden":false,"merged":[]}

{"sheet":"Round7","index":16,"n_rows":0,"n_cols":0,"rows_kept":0,"cut":false,"hidden":false,"merged":[]}

{"sheet":"Round8","index":17,"n_rows":0,"n_cols":0,"rows_kept":0,"cut":false,"hidden":false,"merged":[]}

{"sheet":"Round9","index":18,"n_rows":0,"n_cols":0,"rows_kept":0,"cut":false,"hidden":false,"merged":[]}

{"sheet":"NAF","index":19,"n_rows":861,"n_cols":1,"rows_kept":861,"cut":false,"hidden":false,"merged":[]}
["<?xml version=\"1.0\" encoding=\"UTF-8\"?>"]
["<nafReport xmlns:blo=\"http://www.bloodbowl.net\">"]
["<organiser>Mike</organiser>"]
["<coaches>"]
["<coach>"]
["<name>Alex</name>"]
["<number>16761</number>"]
["<team>Skaven</team>"]
{"$rows_left_out":854}
{"sheet":"Working","index":20,"n_rows":36,"n_cols":34,"rows_kept":36,"cut":false,"hidden":false,"merged":[]}
[null,null,null,null,null,null,null,null,null,null,null,null,null,null,null,null,null,null,null,null,null,null,null,null,null,"Latest Rd:",2]
[null,null,null,null,null,null,null,null,null,null,null,null,null,null,null,null,null,null,null,null,null,null,null,null,null,"Players:",{"$f":"COUNTA(Players!B:B)-1","v":128},null,null,null,"Max Score",{"$f":"Setup!B19*TeamSize*Setup!B19+Setup!B19","v":34}]
[null,null,null,null,null,null,null,null,null,null,null,null,null,null,null,null,null,null,null,null,null,null,null,null,null,"Display",14,"Columns"]
[null,null,null,null,null,null,null,null,null,null,null,null,null,null,null,null,null,null,null,null,null,null,null,null,null,"Enter",7,"Columns"]
[null,null,null,null,null,null,null,null,null,null,null,null,null,null,null,null,null,null,null,null,null,null,null,null,null,"Max random",3]
[null,null,null,null,null,null,null,null,null,null,null,null,null,null,null,null,null,null,null,null,null,null,null,null,null,"Number of Groups",{"$f":"COUNTA(Players!M:M)-1","v":16},null,null,null,"Group"]
[null,null,null,null,null,null,null,null,null,null,null,null,null,null,null,null,null,null,null,null,null,null,null,null,null,null,null,null,null,null,"Individual"]
[null,null,null,null,null,null,null,null,null,null,null,null,null,null,null,null,null,null,null,null,null,null,null,null,null,"Group display",18,"columns"]
{"$rows_left_out":29}
{"sheet":"ChangeLog","index":21,"n_rows":29,"n_cols":4,"rows_kept":29,"cut":false,"hidden":false,"merged":[]}
[null,"This spreadsheet is based on one by Kaper on an Excel forum: http://www.excelforum.com/excel-programming-vba-macros/1105569-swiss-pairing-algorithm-in-excel-to-organize-a-chess-tournament.html"]
[null,"Massive thanks due to him!"]
[null,"The original was used for Chess, and it has been adapted to work for Blood Bowl by sann0638 (Mike Davies)"]
[]
["Version","Summary","Date","Notes"]
["1.0","Multi-sheet version of the chess","2016-06-19"]
[1.1000000000000001,"Remove Black and White stuff","2016-06-19"]
[1.2,"Change to TDs to generate points","2016-06-19"]
{"$rows_left_out":21}