{"text_format":"1","workbook":"xlsx","n_sheets":5,"sheets":["Players","FixturePaste","PrintOut","Display","Buttons"],"not_rendered":{"charts":0,"images":0,"macros":1,"external_links":1,"defined_names":3,"comments":1,"pivot_tables":0},"unopened":[],"bounds":{"document_bytes":16777216,"sheet_cells":100000,"rows_first":2000,"rows_last":500,"rows_between":2000,"halvings":0,"cell_chars":16384,"cell_head_chars":4096},"cells_cut":0,"cells_raw":0,"read":"whole","date_system":"1900"}

{"sheet":"Players","index":0,"n_rows":129,"n_cols":6,"rows_kept":129,"cut":false,"hidden":false,"merged":[]}
["Num","Display Name","NAF Name","NAF Number (Random)","Race","Group"]
[{"$f":"IF(C2=\"\",\"\",MAX(A$1:A1)+1)","v":1},"Driesfield ","Driesfield ",6183,"Slann","Belgium"]
[{"$f":"IF(C3=\"\",\"\",MAX(A$1:A2)+1)","v":2},"Malodoror ","Malodoror ",20793,"Chaos Pact","Belgium"]
[{"$f":"IF(C4=\"\",\"\",MAX(A$1:A3)+1)","v":3},"JJ ","JJ ",10488,"Underworld","Belgium"]
[{"$f":"IF(C5=\"\",\"\",MAX(A$1:A4)+1)","v":4},"Araznaroth ","Araznaroth ",13199,"Goblins","Belgium"]
[{"$f":"IF(C6=\"\",\"\",MAX(A$1:A5)+1)","v":5},"Woete ","Woete ",12500,"Chaos Dwarves","Belgium"]
[{"$f":"IF(C7=\"\",\"\",MAX(A$1:A6)+1)","v":6},"gninocker ","gninocker ",17832,"Vampires","Belgium"]
[{"$f":"IF(C8=\"\",\"\",MAX(A$1:A7)+1)","v":7},"Phoenix11 ","Phoenix11 ",8402,"Dark Elves","Belgium"]
[{"$f":"IF(C9=\"\",\"\",MAX(A$1:A8)+1)","v":8},"Dekra1979 ","Dekra1979 ",16259,"High Elves","Belgium"]
[{"$f":"IF(C10=\"\",\"\",MAX(A$1:A9)+1)","v":9},"Tripleskull ","Tripleskull ",9524,"Chaos","Denmark"]
[{"$f":"IF(C11=\"\",\"\",MAX(A$1:A10)+1)","v":10},"MissSweden ","MissSweden ",11498,"Chaos","Denmark"]
[{"$f":"IF(C12=\"\",\"\",MAX(A$1:A11)+1)","v":11},"kfoged ","kfoged ",10691,"Slann","Denmark"]
[{"$f":"IF(C13=\"\",\"\",MAX(A$1:A12)+1)","v":12},"Tank ","Tank ",11501,"Necromantic","Denmark"]
[{"$f":"IF(C14=\"\",\"\",MAX(A$1:A13)+1)","v":13},"Topper ","Topper ",6363,"Chaos","Denmark"]
[{"$f":"IF(C15=\"\",\"\",MAX(A$1:A14)+1)","v":14},"SpecialOne ","SpecialOne ",16742,"Lizardmen","Denmark"]
[{"$f":"IF(C16=\"\",\"\",MAX(A$1:A15)+1)","v":15},"Jaqra ","Jaqra ",19750,"Skaven","Denmark"]
[{"$f":"IF(C17=\"\",\"\",MAX(A$1:A16)+1)","v":16},"Niebling ","Niebling ",11499,"Amazons","Denmark"]
[{"$f":"IF(C18=\"\",\"\",MAX(A$1:A17)+1)","v":17},"Lycos ","Lycos ",2870,"Ogres","England"]
[{"$f":"IF(C19=\"\",\"\",MAX(A$1:A18)+1)","v":18},"PurpleGoo ","PurpleGoo ",11777,"Amazons","England"]
[{"$f":"IF(C20=\"\",\"\",MAX(A$1:A19)+1)","v":19},"Geggster ","Geggster ",70,"Orc","England"]
[{"$f":"IF(C21=\"\",\"\",MAX(A$1:A20)+1)","v":20},"Podfrey ","Podfrey ",149,"Slann","England"]
[{"$f":"IF(C22=\"\",\"\",MAX(A$1:A21)+1)","v":21},"JimJimany ","JimJimany ",12403,"Goblins","England"]
[{"$f":"IF(C23=\"\",\"\",MAX(A$1:A22)+1)","v":22},"Joemanji ","Joemanji ",3312,"Chaos","England"]
[{"$f":"IF(C24=\"\",\"\",MAX(A$1:A23)+1)","v":23},"Mubo ","Mubo ",13409,"Amazons","England"]
[{"$f":"IF(C25=\"\",\"\",MAX(A$1:A24)+1)","v":24},"Wilzif ","Wilzif ",8901,"Underworld","England"]
[{"$f":"IF(B26=\"\",\"\",MAX(A$1:A25)+1)","v":25},"MacWitt ","MacWitt ",19932,"Elves","Finland"]
[{"$f":"IF(B27=\"\",\"\",MAX(A$1:A26)+1)","v":26},"Harza ","Harza ",20060,"Dwarves","Finland"]
[{"$f":"IF(B28=\"\",\"\",MAX(A$1:A27)+1)","v":27},"jopotzuki ","jopotzuki ",20783,"Nurgle's Rotters","Finland"]
[{"$f":"IF(B29=\"\",\"\",MAX(A$1:A28)+1)","v":28},"edheim ","edheim ",20760,"Chaos","Finland"]
[{"$f":"IF(B30=\"\",\"\",MAX(A$1:A29)+1)","v":29},"BeerBeer ","BeerBeer ",18245,"Necromantic","Finland"]
[{"$f":"IF(B31=\"\",\"\",MAX(A$1:A30)+1)","v":30},"J-Ho","J-Ho",19106,"Nurgle's Rotters","Finland"]
[{"$f":"IF(B32=\"\",\"\",MAX(A$1:A31)+1)","v":31},"ratogre ","ratogre ",22007,"Necromantic","Finland"]
[{"$f":"IF(B33=\"\",\"\",MAX(A$1:A32)+1)","v":32},"valkohukka ","valkohukka ",18772,"Slann","Finland"]
[{"$f":"IF(B34=\"\",\"\",MAX(A$1:A33)+1)","v":33},"BiBi ","BiBi ",11491,"Undead","France"]
[{"$f":"IF(B35=\"\",\"\",MAX(A$1:A34)+1)","v":34},"Bouzzy ","Bouzzy ",15733,"Chaos Pact","France"]
[{"$f":"IF(B36=\"\",\"\",MAX(A$1:A35)+1)","v":35},"BudWiser ","BudWiser ",12987,"Necromantic","France"]
[{"$f":"IF(B37=\"\",\"\",MAX(A$1:A36)+1)","v":36},"Gros Nain ","Gros Nain ",14524,"Norse","France"]
[{"$f":"IF(B38=\"\",\"\",MAX(A$1:A37)+1)","v":37},"Harti ","Harti ",13583,"Skaven","France"]
[{"$f":"IF(B39=\"\",\"\",MAX(A$1:A38)+1)","v":38},"Justicium ","Justicium ",12319,"Wood Elves","France"]
[{"$f":"IF(B40=\"\",\"\",MAX(A$1:A39)+1)","v":39},"Matt le fou ","Matt le fou ",13561,"Undead","France"]
[{"$f":"IF(B41=\"\",\"\",MAX(A$1:A40)+1)","v":40},"Simon_ACP ","Simon_ACP ",17603,"Humans","France"]
[{"$f":"IF(B42=\"\",\"\",MAX(A$1:A41)+1)","v":41},"Arioso ","Arioso ",18738,"Orc","Germany"]
[{"$f":"IF(B43=\"\",\"\",MAX(A$1:A42)+1)","v":42},"RoterSternHochdah ","RoterSternHochdah ",18704,"Chaos Dwarves","Germany"]
[{"$f":"IF(B44=\"\",\"\",MAX(A$1:A43)+1)","v":43},"Muadib ","Muadib ",2800,"Khemri","Germany"]
[{"$f":"IF(B45=\"\",\"\",MAX(A$1:A44)+1)","v":44},"Candlejack ","Candlejack ",5844,"Undead","Germany"]
[{"$f":"IF(B46=\"\",\"\",MAX(A$1:A45)+1)","v":45},"Gaunab ","Gaunab ",2150,"Orc","Germany"]
[{"$f":"IF(B47=\"\",\"\",MAX(A$1:A46)+1)","v":46},"Prince ","Prince ",341,"Lizardmen","Germany"]
[{"$f":"IF(B48=\"\",\"\",MAX(A$1:A47)+1)","v":47},"DocMaxx ","DocMaxx ",16347,"Chaos Pact","Germany"]
[{"$f":"IF(B49=\"\",\"\",MAX(A$1:A48)+1)","v":48},"Jonny_Kanone ","Jonny_Kanone ",9621,"Chaos Dwarves","Germany"]
[{"$f":"IF(B50=\"\",\"\",MAX(A$1:A49)+1)","v":49},"BlackOrc ","BlackOrc ",6233,"Chaos Pact","Hungary"]
[{"$f":"IF(B51=\"\",\"\",MAX(A$1:A50)+1)","v":50},"Itzla ","Itzla ",9758,"Chaos Dwarves","Hungary"]
[{"$f":"IF(B52=\"\",\"\",MAX(A$1:A51)+1)","v":51},"Wolio ","Wolio ",20061,"Dark Elves","Hungary"]
[{"$f":"IF(B53=\"\",\"\",MAX(A$1:A52)+1)","v":52},"noraal ","noraal ",21798,"Underworld","Hungary"]
[{"$f":"IF(B54=\"\",\"\",MAX(A$1:A53)+1)","v":53},"Favi ","Favi ",20062,"Skaven","Hungary"]
[{"$f":"IF(B55=\"\",\"\",MAX(A$1:A54)+1)","v":54},"cz ","cz ",21604,"Underworld","Hungary"]
[{"$f":"IF(B56=\"\",\"\",MAX(A$1:A55)+1)","v":55},"swifty ","swifty ",20309,"Khemri","Hungary"]
[{"$f":"IF(B57=\"\",\"\",MAX(A$1:A56)+1)","v":56},"Alex05 ","Alex05 ",22352,"Orc","Hungary"]
[{"$f":"IF(B58=\"\",\"\",MAX(A$1:A57)+1)","v":57},"Beppe ","Beppe ",3564,"Orc","Italy"]
[{"$f":"IF(B59=\"\",\"\",MAX(A$1:A58)+1)","v":58},"Dirold ","Dirold ",5900,"Amazons","Italy"]
[{"$f":"IF(B60=\"\",\"\",MAX(A$1:A59)+1)","v":59},"Farina ","Farina ",3533,"Chaos Dwarves","Italy"]
[{"$f":"IF(B61=\"\",\"\",MAX(A$1:A60)+1)","v":60},"Kaltenland ","Kaltenland ",11924,"Chaos Pact","Italy"]
[{"$f":"IF(B62=\"\",\"\",MAX(A$1:A61)+1)","v":61},"Liam ","Liam ",5906,"Wood Elves","Italy"]
[{"$f":"IF(B63=\"\",\"\",MAX(A$1:A62)+1)","v":62},"Matte8 ","Matte8 ",13785,"Khemri","Italy"]
[{"$f":"IF(B64=\"\",\"\",MAX(A$1:A63)+1)","v":63},"Spartako ","Spartako ",13417,"Skaven","Italy"]
[{"$f":"IF(B65=\"\",\"\",MAX(A$1:A64)+1)","v":64},"Verrinho ","Verrinho ",16930,"Nurgle's Rotters","Italy"]
[{"$f":"IF(B66=\"\",\"\",MAX(A$1:A65)+1)","v":65},"zulu ","zulu ",16829,"Goblins","Norway"]
[{"$f":"IF(B67=\"\",\"\",MAX(A$1:A66)+1)","v":66},"Endalos ","Endalos ",17242,"Wood Elves","Norway"]
[{"$f":"IF(B68=\"\",\"\",MAX(A$1:A67)+1)","v":67},"The_Ref ","The_Ref ",9441,"Amazons","Norway"]
[{"$f":"IF(B69=\"\",\"\",MAX(A$1:A68)+1)","v":68},"straume ","straume ",20685,"High Elves","Norway"]
[{"$f":"IF(B70=\"\",\"\",MAX(A$1:A69)+1)","v":69},"bothun ","bothun ",20953,"Wood Elves","Norway"]
[{"$f":"IF(B71=\"\",\"\",MAX(A$1:A70)+1)","v":70},"FrankPedersen ","FrankPedersen ",20899,"Chaos","Norway"]
[{"$f":"IF(B72=\"\",\"\",MAX(A$1:A71)+1)","v":71},"mynock ","mynock ",20775,"Goblins","Norway"]
[{"$f":"IF(B73=\"\",\"\",MAX(A$1:A72)+1)","v":72},"GreatWhiteHope ","GreatWhiteHope ",20881,"Lizardmen","Norway"]
[{"$f":"IF(B74=\"\",\"\",MAX(A$1:A73)+1)","v":73},"Mewash ","Mewash ",21627,"Vampires","Poland"]
[{"$f":"IF(B75=\"\",\"\",MAX(A$1:A74)+1)","v":74},"Reszka ","Reszka ",21573,"Dark Elves","Poland"]
[{"$f":"IF(B76=\"\",\"\",MAX(A$1:A75)+1)","v":75},"Leonek ","Leonek ",22375,"Vampires","Poland"]
[{"$f":"IF(B77=\"\",\"\",MAX(A$1:A76)+1)","v":76},"Domingo ","Domingo ",20280,"Ogres","Poland"]
[{"$f":"IF(B78=\"\",\"\",MAX(A$1:A77)+1)","v":77},"Slimaq ","Slimaq ",21957,"Dark Elves","Poland"]
[{"$f":"IF(B79=\"\",\"\",MAX(A$1:A78)+1)","v":78},"Warrior1980 ","Warrior1980 ",22376,"Norse","Poland"]
[{"$f":"IF(B80=\"\",\"\",MAX(A$1:A79)+1)","v":79},"Juniooor7 ","Juniooor7 ",22455,"Norse","Poland"]
[{"$f":"IF(B81=\"\",\"\",MAX(A$1:A80)+1)","v":80},"Shawass ","Shawass ",18416,"Chaos Pact","Poland"]
[{"$f":"IF(B82=\"\",\"\",MAX(A$1:A81)+1)","v":81},"DonShula ","DonShula ",14445,"Skaven","Scotland"]
[{"$f":"IF(B83=\"\",\"\",MAX(A$1:A82)+1)","v":82},"Garrick ","Garrick ",18506,"Chaos Dwarves","Scotland"]
[{"$f":"IF(B84=\"\",\"\",MAX(A$1:A83)+1)","v":83},"Purdindas ","Purdindas ",10831,"Undead","Scotland"]
[{"$f":"IF(B85=\"\",\"\",MAX(A$1:A84)+1)","v":84},"JamesEs ","JamesEs ",17875,"Vampires","Scotland"]
[{"$f":"IF(B86=\"\",\"\",MAX(A$1:A85)+1)","v":85},"sann0638 ","sann0638 ",8866,"Humans","Scotland"]
[{"$f":"IF(B87=\"\",\"\",MAX(A$1:A86)+1)","v":86},"Valen ","Valen ",1538,"Nurgle's Rotters","Scotland"]
[{"$f":"IF(B88=\"\",\"\",MAX(A$1:A87)+1)","v":87},"Loki ","Loki ",371,"Underworld","Scotland"]
[{"$f":"IF(B89=\"\",\"\",MAX(A$1:A88)+1)","v":88},"HumptyTrump ","HumptyTrump ",20360,"Skaven","Scotland"]
[{"$f":"IF(B90=\"\",\"\",MAX(A$1:A89)+1)","v":89},"Dark Duke ","Dark Duke ",2925,"Chaos Dwarves","Spain"]
[{"$f":"IF(B91=\"\",\"\",MAX(A$1:A90)+1)","v":90},"Obeliz ","Obeliz ",2519,"Chaos","Spain"]
[{"$f":"IF(B92=\"\",\"\",MAX(A$1:A91)+1)","v":91},"Joanet ","Joanet ",7690,"Khemri","Spain"]
[{"$f":"IF(B93=\"\",\"\",MAX(A$1:A92)+1)","v":92},"Duke_Luthor_Von_Hawkfire ","Duke_Luthor_Von_Hawkfire ",11793,"Vampires","Spain"]
[{"$f":"IF(B94=\"\",\"\",MAX(A$1:A93)+1)","v":93},"Barry ","Barry ",3290,"High Elves","Spain"]
[{"$f":"IF(B95=\"\",\"\",MAX(A$1:A94)+1)","v":94},"Idroj ","Idroj ",20930,"Dwarves","Spain"]
[{"$f":"IF(B96=\"\",\"\",MAX(A$1:A95)+1)","v":95},"Malasnoticias ","Malasnoticias ",17068,"Chaos Pact","Spain"]
[{"$f":"IF(B97=\"\",\"\",MAX(A$1:A96)+1)","v":96},"Tactel ","Tactel ",20218,"High Elves","Spain"]
[{"$f":"IF(B98=\"\",\"\",MAX(A$1:A97)+1)","v":97},"Melisqus ","Melisqus ",16238,"Orc","Sweden"]
[{"$f":"IF(B99=\"\",\"\",MAX(A$1:A98)+1)","v":98},"Inforthepain ","Inforthepain ",19483,"Wood Elves","Sweden"]
[{"$f":"IF(B100=\"\",\"\",MAX(A$1:A99)+1)","v":99},"Pidpad ","Pidpad ",20957,"High Elves","Sweden"]
[{"$f":"IF(B101=\"\",\"\",MAX(A$1:A100)+1)","v":100},"Skuld ","Skuld ",20481,"Dark Elves","Sweden"]
[{"$f":"IF(B102=\"\",\"\",MAX(A$1:A101)+1)","v":101},"JohnnyD ","JohnnyD ",18171,"Halflings","Sweden"]
[{"$f":"IF(B103=\"\",\"\",MAX(A$1:A102)+1)","v":102},"Skoberget ","Skoberget ",19448,"Slann","Sweden"]
[{"$f":"IF(B104=\"\",\"\",MAX(A$1:A103)+1)","v":103},"Dragons ","Dragons ",19003,"Orc","Sweden"]
[{"$f":"IF(B105=\"\",\"\",MAX(A$1:A104)+1)","v":104},"Pellevin ","Pellevin ",19271,"Elves","Sweden"]
[{"$f":"IF(B106=\"\",\"\",MAX(A$1:A105)+1)","v":105},"Strider84 ","Strider84 ",14113,"Goblins","Switzerland"]
[{"$f":"IF(B107=\"\",\"\",MAX(A$1:A106)+1)","v":106},"Jokaero ","Jokaero ",2785,"Vampires","Switzerland"]
[{"$f":"IF(B108=\"\",\"\",MAX(A$1:A107)+1)","v":107},"Phifoe ","Phifoe ",16959,"Goblins","Switzerland"]
[{"$f":"IF(B109=\"\",\"\",MAX(A$1:A108)+1)","v":108},"Goss ","Goss ",18266,"Humans","Switzerland"]
[{"$f":"IF(B110=\"\",\"\",MAX(A$1:A109)+1)","v":109},"Madmatt13 ","Madmatt13 ",19790,"Norse","Switzerland"]
[{"$f":"IF(B111=\"\",\"\",MAX(A$1:A110)+1)","v":110},"Elrik ","Elrik ",19344,"High Elves","Switzerland"]
[{"$f":"IF(B112=\"\",\"\",MAX(A$1:A111)+1)","v":111},"sigu70 ","sigu70 ",17003,"Wood Elves","Switzerland"]
[{"$f":"IF(B113=\"\",\"\",MAX(A$1:A112)+1)","v":112},"Macabeo ","Macabeo ",18608,"Chaos Pact","Switzerland"]
[{"$f":"IF(B114=\"\",\"\",MAX(A$1:A113)+1)","v":113},"Balder ","Balder ",17725,"Dark Elves","Viking"]
[{"$f":"IF(B115=\"\",\"\",MAX(A$1:A114)+1)","v":114},"Corwin ","Corwin ",17878,"Chaos Pact","Viking"]
[{"$f":"IF(B116=\"\",\"\",MAX(A$1:A115)+1)","v":115},"Faccko ","Faccko ",17893,"Dwarves","Viking"]
[{"$f":"IF(B117=\"\",\"\",MAX(A$1:A116)+1)","v":116},"Mufflo ","Mufflo ",15048,"Ogres","Viking"]
[{"$f":"IF(B118=\"\",\"\",MAX(A$1:A117)+1)","v":117},"brocCooli ","brocCooli ",12552,"Slann","Viking"]
[{"$f":"IF(B119=\"\",\"\",MAX(A$1:A118)+1)","v":118},"Duckwing ","Duckwing ",16278,"Vampires","Viking"]
[{"$f":"IF(B120=\"\",\"\",MAX(A$1:A119)+1)","v":119},"Bernuz ","Bernuz ",19542,"Lizardmen","Viking"]
[{"$f":"IF(B121=\"\",\"\",MAX(A$1:A120)+1)","v":120},"Purrelito ","Purrelito ",15323,"Skaven","Viking"]
[{"$f":"IF(B122=\"\",\"\",MAX(A$1:A121)+1)","v":121},"nonumber ","nonumber ",8923,"Skaven","Wales"]
[{"$f":"IF(B123=\"\",\"\",MAX(A$1:A122)+1)","v":122},"20Phoenix ","20Phoenix ",19395,"Chaos Dwarves","Wales"]
[{"$f":"IF(B124=\"\",\"\",MAX(A$1:A123)+1)","v":123},"SFisher91 ","SFisher91 ",16057,"Chaos Pact","Wales"]
[{"$f":"IF(B125=\"\",\"\",MAX(A$1:A124)+1)","v":124},"Dionysian ","Dionysian ",19480,"Dark Elves","Wales"]
[{"$f":"IF(B126=\"\",\"\",MAX(A$1:A125)+1)","v":125},"Northernknight ","Northernknight ",7569,"Chaos","Wales"]
[{"$f":"IF(B127=\"\",\"\",MAX(A$1:A126)+1)","v":126},"MadeofWelsh ","MadeofWelsh ",12184,"Lizardmen","Wales"]
[{"$f":"IF(B128=\"\",\"\",MAX(A$1:A127)+1)","v":127},"Ploppy_McPloppy ","Ploppy_McPloppy ",16417,"Slann","Wales"]
[{"$f":"IF(B129=\"\",\"\",MAX(A$1:A128)+1)","v":128},"andydavo ","andydavo ",19726,"Ogres","Wales"]

{"sheet":"FixturePaste","index":1,"n_rows":65,"n_cols":3,"rows_kept":65,"cut":false,"hidden":false,"merged":[]}
["Table","Home Player","Away Player"]
[1,"Pellevin ","Domingo "]
[{"$f":"A2+1","v":2},"Dragons ","Mewash "]
[{"$f":"A3+1","v":3},"Inforthepain ","Reszka "]
[4,"Skoberget ","Leonek "]
[5,"JohnnyD ","Slimaq "]
[6,"Melisqus ","Warrior1980 "]
[7,"Skuld ","Juniooor7 "]
[8,"Pidpad ","Shawass "]
[9,"The_Ref ","Joemanji "]
[10,"straume ","Geggster "]
[11,"GreatWhiteHope ","PurpleGoo "]
[12,"mynock ","Wilzif "]
[13,"FrankPedersen ","JimJimany "]
[14,"zulu ","Lycos "]
[15,"Endalos ","Podfrey "]
[16,"bothun ","Mubo "]
[17,"Purdindas ","Jokaero "]
[18,"Garrick ","Phifoe "]
[19,"DonShula ","Macabeo "]
[20,"sann0638 ","Madmatt13 "]
[21,"Loki ","Strider84 "]
[22,"JamesEs ","sigu70 "]
[23,"Valen ","Elrik "]
[24,"HumptyTrump ","Goss "]
[25,"Araznaroth ","Purrelito "]
[26,"Dekra1979 ","brocCooli "]
[27,"Driesfield ","Mufflo "]
[28,"JJ ","Duckwing "]
[29,"gninocker ","Bernuz "]
[30,"Malodoror ","Balder "]
[31,"Phoenix11 ","Corwin "]
[32,"Woete ","Faccko "]
[33,"Dionysian ","Obeliz "]
[34,"SFisher91 ","Barry "]
[35,"Ploppy_McPloppy ","Malasnoticias "]
[36,"20Phoenix ","Tactel "]
[37,"andydavo ","Dark Duke "]
[38,"MadeofWelsh ","Joanet "]
[39,"Northernknight ","Duke_Luthor_Von_Hawkfire "]
[40,"nonumber ","Idroj "]
[41,"Matte8 ","Jaqra "]
[42,"Kaltenland ","Niebling "]
[43,"Verrinho ","Tank "]
[44,"Dirold ","MissSweden "]
[45,"Farina ","Tripleskull "]
[46,"Beppe ","Topper "]
[47,"Liam ","SpecialOne "]
[48,"Spartako ","kfoged "]
[49,"Simon_ACP ","valkohukka "]
[50,"Gros Nain ","J-Ho"]
[51,"BiBi ","BeerBeer "]
[52,"Matt le fou ","jopotzuki "]
[53,"Harti ","MacWitt "]
[54,"BudWiser ","Harza "]
[55,"Justicium ","edheim "]
[56,"Bouzzy ","ratogre "]
[57,"BlackOrc ","Candlejack "]
[58,"noraal ","Jonny_Kanone "]
[59,"Alex05 ","DocMaxx "]
[60,"Itzla ","Muadib "]
[61,"Wolio ","Arioso "]
[62,"Favi ","Gaunab "]
[63,"swifty ","Prince "]
[64,"cz ","RoterSternHochdah "]

{"sheet":"PrintOut","index":2,"n_rows":65,"n_cols":7,"rows_kept":65,"cut":false,"hidden":false,"merged":[]}
["Table","Home Player","Away Player","Home TD","Away TD","Home Cas","Away Cas"]
[1,"Pellevin ","Domingo "]
[{"$f":"A2+1","v":2},"Dragons ","Mewash "]
[{"$f":"A3+1","v":3},"Inforthepain ","Reszka "]
[4,"Skoberget ","Leonek "]
[5,"JohnnyD ","Slimaq "]
[6,"Melisqus ","Warrior1980 "]
[7,"Skuld ","Juniooor7 "]
[8,"Pidpad ","Shawass "]
[9,"The_Ref ","Joemanji "]
[10,"straume ","Geggster "]
[11,"GreatWhiteHope ","PurpleGoo "]
[12,"mynock ","Wilzif "]
[13,"FrankPedersen ","JimJimany "]
[14,"zulu ","Lycos "]
[15,"Endalos ","Podfrey "]
[16,"bothun ","Mubo "]
[17,"Purdindas ","Jokaero "]
[18,"Garrick ","Phifoe "]
[19,"DonShula ","Macabeo "]
[20,"sann0638 ","Madmatt13 "]
[21,"Loki ","Strider84 "]
[22,"JamesEs ","sigu70 "]
[23,"Valen ","Elrik "]
[24,"HumptyTrump ","Goss "]
[25,"Araznaroth ","Purrelito "]
[26,"Dekra1979 ","brocCooli "]
[27,"Driesfield ","Mufflo "]
[28,"JJ ","Duckwing "]
[29,"gninocker ","Bernuz "]
[30,"Malodoror ","Balder "]
[31,"Phoenix11 ","Corwin "]
[32,"Woete ","Faccko "]
[33,"Dionysian ","Obeliz "]
[34,"SFisher91 ","Barry "]
[35,"Ploppy_McPloppy ","Malasnoticias "]
[36,"20Phoenix ","Tactel "]
[37,"andydavo ","Dark Duke "]
[38,"MadeofWelsh ","Joanet "]
[39,"Northernknight ","Duke_Luthor_Von_Hawkfire "]
[40,"nonumber ","Idroj "]
[41,"Matte8 ","Jaqra "]
[42,"Kaltenland ","Niebling "]
[43,"Verrinho ","Tank "]
[44,"Dirold ","MissSweden "]
[45,"Farina ","Tripleskull "]
[46,"Beppe ","Topper "]
[47,"Liam ","SpecialOne "]
[48,"Spartako ","kfoged "]
[49,"Simon_ACP ","valkohukka "]
[50,"Gros Nain ","J-Ho"]
[51,"BiBi ","BeerBeer "]
[52,"Matt le fou ","jopotzuki "]
[53,"Harti ","MacWitt "]
[54,"BudWiser ","Harza "]
[55,"Justicium ","edheim "]
[56,"Bouzzy ","ratogre "]
[57,"BlackOrc ","Candlejack "]
[58,"noraal ","Jonny_Kanone "]
[59,"Alex05 ","DocMaxx "]
[60,"Itzla ","Muadib "]
[61,"Wolio ","Arioso "]
[62,"Favi ","Gaunab "]
[63,"swifty ","Prince "]
[64,"cz ","RoterSternHochdah "]

{"sheet":"Display","index":3,"n_rows":66,"n_cols":7,"rows_kept":66,"cut":false,"hidden":false,"merged":[[0,1,0,3],[0,4,0,6]]}
[null,"Home",null,null,"Away"]
["Table","Player","Country","Race","Player","Country","Race"]
[1,{"$f":"FixturePaste!B2","v":"Pellevin "},{"$f":"VLOOKUP(B3,Players!$C$2:$F$129,4,FALSE)","v":"Sweden"},{"$f":"VLOOKUP(B3,Players!$C$2:$F$129,3,FALSE)","v":"Elves"},{"$f":"FixturePaste!C2","v":"Domingo "},{"$f":"VLOOKUP(E3,Players!$C$2:$F$129,4,FALSE)","v":"Poland"},{"$f":"VLOOKUP(E3,Players!$C$2:$F$129,3,FALSE)","v":"Ogres"}]
[2,{"$f":"FixturePaste!B3","v":"Dragons "},{"$f":"VLOOKUP(B4,Players!$C$2:$F$129,4,FALSE)","v":"Sweden"},{"$f":"VLOOKUP(B4,Players!$C$2:$F$129,3,FALSE)","v":"Orc"},{"$f":"FixturePaste!C3","v":"Mewash "},{"$f":"VLOOKUP(E4,Players!$C$2:$F$129,4,FALSE)","v":"Poland"},{"$f":"VLOOKUP(E4,Players!$C$2:$F$129,3,FALSE)","v":"Vampires"}]
[3,{"$f":"FixturePaste!B4","v":"Inforthepain "},{"$f":"VLOOKUP(B5,Players!$C$2:$F$129,4,FALSE)","v":"Sweden"},{"$f":"VLOOKUP(B5,Players!$C$2:$F$129,3,FALSE)","v":"Wood Elves"},{"$f":"FixturePaste!C4","v":"Reszka "},{"$f":"VLOOKUP(E5,Players!$C$2:$F$129,4,FALSE)","v":"Poland"},{"$f":"VLOOKUP(E5,Players!$C$2:$F$129,3,FALSE)","v":"Dark Elves"}]
[4,{"$f":"FixturePaste!B5","v":"Skoberget "},{"$f":"VLOOKUP(B6,Players!$C$2:$F$129,4,FALSE)","v":"Sweden"},{"$f":"VLOOKUP(B6,Players!$C$2:$F$129,3,FALSE)","v":"Slann"},{"$f":"FixturePaste!C5","v":"Leonek "},{"$f":"VLOOKUP(E6,Players!$C$2:$F$129,4,FALSE)","v":"Poland"},{"$f":"VLOOKUP(E6,Players!$C$2:$F$129,3,FALSE)","v":"Vampires"}]
[5,{"$f":"FixturePaste!B6","v":"JohnnyD "},{"$f":"VLOOKUP(B7,Players!$C$2:$F$129,4,FALSE)","v":"Sweden"},{"$f":"VLOOKUP(B7,Players!$C$2:$F$129,3,FALSE)","v":"Halflings"},{"$f":"FixturePaste!C6","v":"Slimaq "},{"$f":"VLOOKUP(E7,Players!$C$2:$F$129,4,FALSE)","v":"Poland"},{"$f":"VLOOKUP(E7,Players!$C$2:$F$129,3,FALSE)","v":"Dark Elves"}]
[6,{"$f":"FixturePaste!B7","v":"Melisqus "},{"$f":"VLOOKUP(B8,Players!$C$2:$F$129,4,FALSE)","v":"Sweden"},{"$f":"VLOOKUP(B8,Players!$C$2:$F$129,3,FALSE)","v":"Orc"},{"$f":"FixturePaste!C7","v":"Warrior1980 "},{"$f":"VLOOKUP(E8,Players!$C$2:$F$129,4,FALSE)","v":"Poland"},{"$f":"VLOOKUP(E8,Players!$C$2:$F$129,3,FALSE)","v":"Norse"}]
[7,{"$f":"FixturePaste!B8","v":"Skuld "},{"$f":"VLOOKUP(B9,Players!$C$2:$F$129,4,FALSE)","v":"Sweden"},{"$f":"VLOOKUP(B9,Players!$C$2:$F$129,3,FALSE)","v":"Dark Elves"},{"$f":"FixturePaste!C8","v":"Juniooor7 "},{"$f":"VLOOKUP(E9,Players!$C$2:$F$129,4,FALSE)","v":"Poland"},{"$f":"VLOOKUP(E9,Players!$C$2:$F$129,3,FALSE)","v":"Norse"}]
[8,{"$f":"FixturePaste!B9","v":"Pidpad "},{"$f":"VLOOKUP(B10,Players!$C$2:$F$129,4,FALSE)","v":"Sweden"},{"$f":"VLOOKUP(B10,Players!$C$2:$F$129,3,FALSE)","v":"High Elves"},{"$f":"FixturePaste!C9","v":"Shawass "},{"$f":"VLOOKUP(E10,Players!$C$2:$F$129,4,FALSE)","v":"Poland"},{"$f":"VLOOKUP(E10,Players!$C$2:$F$129,3,FALSE)","v":"Chaos Pact"}]
[9,{"$f":"FixturePaste!B10","v":"The_Ref "},{"$f":"VLOOKUP(B11,Players!$C$2:$F$129,4,FALSE)","v":"Norway"},{"$f":"VLOOKUP(B11,Players!$C$2:$F$129,3,FALSE)","v":"Amazons"},{"$f":"FixturePaste!C10","v":"Joemanji "},{"$f":"VLOOKUP(E11,Players!$C$2:$F$129,4,FALSE)","v":"England"},{"$f":"VLOOKUP(E11,Players!$C$2:$F$129,3,FALSE)","v":"Chaos"}]
[10,{"$f":"FixturePaste!B11","v":"straume "},{"$f":"VLOOKUP(B12,Players!$C$2:$F$129,4,FALSE)","v":"Norway"},{"$f":"VLOOKUP(B12,Players!$C$2:$F$129,3,FALSE)","v":"High Elves"},{"$f":"FixturePaste!C11","v":"Geggster "},{"$f":"VLOOKUP(E12,Players!$C$2:$F$129,4,FALSE)","v":"England"},{"$f":"VLOOKUP(E12,Players!$C$2:$F$129,3,FALSE)","v":"Orc"}]
[11,{"$f":"FixturePaste!B12","v":"GreatWhiteHope "},{"$f":"VLOOKUP(B13,Players!$C$2:$F$129,4,FALSE)","v":"Norway"},{"$f":"VLOOKUP(B13,Players!$C$2:$F$129,3,FALSE)","v":"Lizardmen"},{"$f":"FixturePaste!C12","v":"PurpleGoo "},{"$f":"VLOOKUP(E13,Players!$C$2:$F$129,4,FALSE)","v":"England"},{"$f":"VLOOKUP(E13,Players!$C$2:$F$129,3,FALSE)","v":"Amazons"}]
[12,{"$f":"FixturePaste!B13","v":"mynock "},{"$f":"VLOOKUP(B14,Players!$C$2:$F$129,4,FALSE)","v":"Norway"},{"$f":"VLOOKUP(B14,Players!$C$2:$F$129,3,FALSE)","v":"Goblins"},{"$f":"FixturePaste!C13","v":"Wilzif "},{"$f":"VLOOKUP(E14,Players!$C$2:$F$129,4,FALSE)","v":"England"},{"$f":"VLOOKUP(E14,Players!$C$2:$F$129,3,FALSE)","v":"Underworld"}]
[13,{"$f":"FixturePaste!B14","v":"FrankPedersen "},{"$f":"VLOOKUP(B15,Players!$C$2:$F$129,4,FALSE)","v":"Norway"},{"$f":"VLOOKUP(B15,Players!$C$2:$F$129,3,FALSE)","v":"Chaos"},{"$f":"FixturePaste!C14","v":"JimJimany "},{"$f":"VLOOKUP(E15,Players!$C$2:$F$129,4,FALSE)","v":"England"},{"$f":"VLOOKUP(E15,Players!$C$2:$F$129,3,FALSE)","v":"Goblins"}]
[14,{"$f":"FixturePaste!B15","v":"zulu "},{"$f":"VLOOKUP(B16,Players!$C$2:$F$129,4,FALSE)","v":"Norway"},{"$f":"VLOOKUP(B16,Players!$C$2:$F$129,3,FALSE)","v":"Goblins"},{"$f":"FixturePaste!C15","v":"Lycos "},{"$f":"VLOOKUP(E16,Players!$C$2:$F$129,4,FALSE)","v":"England"},{"$f":"VLOOKUP(E16,Players!$C$2:$F$129,3,FALSE)","v":"Ogres"}]
[15,{"$f":"FixturePaste!B16","v":"Endalos "},{"$f":"VLOOKUP(B17,Players!$C$2:$F$129,4,FALSE)","v":"Norway"},{"$f":"VLOOKUP(B17,Players!$C$2:$F$129,3,FALSE)","v":"Wood Elves"},{"$f":"FixturePaste!C16","v":"Podfrey "},{"$f":"VLOOKUP(E17,Players!$C$2:$F$129,4,FALSE)","v":"England"},{"$f":"VLOOKUP(E17,Players!$C$2:$F$129,3,FALSE)","v":"Slann"}]
[16,{"$f":"FixturePaste!B17","v":"bothun "},{"$f":"VLOOKUP(B18,Players!$C$2:$F$129,4,FALSE)","v":"Norway"},{"$f":"VLOOKUP(B18,Players!$C$2:$F$129,3,FALSE)","v":"Wood Elves"},{"$f":"FixturePaste!C17","v":"Mubo "},{"$f":"VLOOKUP(E18,Players!$C$2:$F$129,4,FALSE)","v":"England"},{"$f":"VLOOKUP(E18,Players!$C$2:$F$129,3,FALSE)","v":"Amazons"}]
[17,{"$f":"FixturePaste!B18","v":"Purdindas "},{"$f":"VLOOKUP(B19,Players!$C$2:$F$129,4,FALSE)","v":"Scotland"},{"$f":"VLOOKUP(B19,Players!$C$2:$F$129,3,FALSE)","v":"Undead"},{"$f":"FixturePaste!C18","v":"Jokaero "},{"$f":"VLOOKUP(E19,Players!$C$2:$F$129,4,FALSE)","v":"Switzerland"},{"$f":"VLOOKUP(E19,Players!$C$2:$F$129,3,FALSE)","v":"Vampires"}]
[18,{"$f":"FixturePaste!B19","v":"Garrick "},{"$f":"VLOOKUP(B20,Players!$C$2:$F$129,4,FALSE)","v":"Scotland"},{"$f":"VLOOKUP(B20,Players!$C$2:$F$129,3,FALSE)","v":"Chaos Dwarves"},{"$f":"FixturePaste!C19","v":"Phifoe "},{"$f":"VLOOKUP(E20,Players!$C$2:$F$129,4,FALSE)","v":"Switzerland"},{"$f":"VLOOKUP(E20,Players!$C$2:$F$129,3,FALSE)","v":"Goblins"}]
[19,{"$f":"FixturePaste!B20","v":"DonShula "},{"$f":"VLOOKUP(B21,Players!$C$2:$F$129,4,FALSE)","v":"Scotland"},{"$f":"VLOOKUP(B21,Players!$C$2:$F$129,3,FALSE)","v":"Skaven"},{"$f":"FixturePaste!C20","v":"Macabeo "},{"$f":"VLOOKUP(E21,Players!$C$2:$F$129,4,FALSE)","v":"Switzerland"},{"$f":"VLOOKUP(E21,Players!$C$2:$F$129,3,FALSE)","v":"Chaos Pact"}]
[20,{"$f":"FixturePaste!B21","v":"sann0638 "},{"$f":"VLOOKUP(B22,Players!$C$2:$F$129,4,FALSE)","v":"Scotland"},{"$f":"VLOOKUP(B22,Players!$C$2:$F$129,3,FALSE)","v":"Humans"},{"$f":"FixturePaste!C21","v":"Madmatt13 "},{"$f":"VLOOKUP(E22,Players!$C$2:$F$129,4,FALSE)","v":"Switzerland"},{"$f":"VLOOKUP(E22,Players!$C$2:$F$129,3,FALSE)","v":"Norse"}]
[21,{"$f":"FixturePaste!B22","v":"Loki "},{"$f":"VLOOKUP(B23,Players!$C$2:$F$129,4,FALSE)","v":"Scotland"},{"$f":"VLOOKUP(B23,Players!$C$2:$F$129,3,FALSE)","v":"Underworld"},{"$f":"FixturePaste!C22","v":"Strider84 "},{"$f":"VLOOKUP(E23,Players!$C$2:$F$129,4,FALSE)","v":"Switzerland"},{"$f":"VLOOKUP(E23,Players!$C$2:$F$129,3,FALSE)","v":"Goblins"}]
[22,{"$f":"FixturePaste!B23","v":"JamesEs "},{"$f":"VLOOKUP(B24,Players!$C$2:$F$129,4,FALSE)","v":"Scotland"},{"$f":"VLOOKUP(B24,Players!$C$2:$F$129,3,FALSE)","v":"Vampires"},{"$f":"FixturePaste!C23","v":"sigu70 "},{"$f":"VLOOKUP(E24,Players!$C$2:$F$129,4,FALSE)","v":"Switzerland"},{"$f":"VLOOKUP(E24,Players!$C$2:$F$129,3,FALSE)","v":"Wood Elves"}]
[23,{"$f":"FixturePaste!B24","v":"Valen "},{"$f":"VLOOKUP(B25,Players!$C$2:$F$129,4,FALSE)","v":"Scotland"},{"$f":"VLOOKUP(B25,Players!$C$2:$F$129,3,FALSE)","v":"Nurgle's Rotters"},{"$f":"FixturePaste!C24","v":"Elrik "},{"$f":"VLOOKUP(E25,Players!$C$2:$F$129,4,FALSE)","v":"Switzerland"},{"$f":"VLOOKUP(E25,Players!$C$2:$F$129,3,FALSE)","v":"High Elves"}]
[24,{"$f":"FixturePaste!B25","v":"HumptyTrump "},{"$f":"VLOOKUP(B26,Players!$C$2:$F$129,4,FALSE)","v":"Scotland"},{"$f":"VLOOKUP(B26,Players!$C$2:$F$129,3,FALSE)","v":"Skaven"},{"$f":"FixturePaste!C25","v":"Goss "},{"$f":"VLOOKUP(E26,Players!$C$2:$F$129,4,FALSE)","v":"Switzerland"},{"$f":"VLOOKUP(E26,Players!$C$2:$F$129,3,FALSE)","v":"Humans"}]
[25,{"$f":"FixturePaste!B26","v":"Araznaroth "},{"$f":"VLOOKUP(B27,Players!$C$2:$F$129,4,FALSE)","v":"Belgium"},{"$f":"VLOOKUP(B27,Players!$C$2:$F$129,3,FALSE)","v":"Goblins"},{"$f":"FixturePaste!C26","v":"Purrelito "},{"$f":"VLOOKUP(E27,Players!$C$2:$F$129,4,FALSE)","v":"Viking"},{"$f":"VLOOKUP(E27,Players!$C$2:$F$129,3,FALSE)","v":"Skaven"}]
[26,{"$f":"FixturePaste!B27","v":"Dekra1979 "},{"$f":"VLOOKUP(B28,Players!$C$2:$F$129,4,FALSE)","v":"Belgium"},{"$f":"VLOOKUP(B28,Players!$C$2:$F$129,3,FALSE)","v":"High Elves"},{"$f":"FixturePaste!C27","v":"brocCooli "},{"$f":"VLOOKUP(E28,Players!$C$2:$F$129,4,FALSE)","v":"Viking"},{"$f":"VLOOKUP(E28,Players!$C$2:$F$129,3,FALSE)","v":"Slann"}]
[27,{"$f":"FixturePaste!B28","v":"Driesfield "},{"$f":"VLOOKUP(B29,Players!$C$2:$F$129,4,FALSE)","v":"Belgium"},{"$f":"VLOOKUP(B29,Players!$C$2:$F$129,3,FALSE)","v":"Slann"},{"$f":"FixturePaste!C28","v":"Mufflo "},{"$f":"VLOOKUP(E29,Players!$C$2:$F$129,4,FALSE)","v":"Viking"},{"$f":"VLOOKUP(E29,Players!$C$2:$F$129,3,FALSE)","v":"Ogres"}]
[28,{"$f":"FixturePaste!B29","v":"JJ "},{"$f":"VLOOKUP(B30,Players!$C$2:$F$129,4,FALSE)","v":"Belgium"},{"$f":"VLOOKUP(B30,Players!$C$2:$F$129,3,FALSE)","v":"Underworld"},{"$f":"FixturePaste!C29","v":"Duckwing "},{"$f":"VLOOKUP(E30,Players!$C$2:$F$129,4,FALSE)","v":"Viking"},{"$f":"VLOOKUP(E30,Players!$C$2:$F$129,3,FALSE)","v":"Vampires"}]
[29,{"$f":"FixturePaste!B30","v":"gninocker "},{"$f":"VLOOKUP(B31,Players!$C$2:$F$129,4,FALSE)","v":"Belgium"},{"$f":"VLOOKUP(B31,Players!$C$2:$F$129,3,FALSE)","v":"Vampires"},{"$f":"FixturePaste!C30","v":"Bernuz "},{"$f":"VLOOKUP(E31,Players!$C$2:$F$129,4,FALSE)","v":"Viking"},{"$f":"VLOOKUP(E31,Players!$C$2:$F$129,3,FALSE)","v":"Lizardmen"}]
[30,{"$f":"FixturePaste!B31","v":"Malodoror "},{"$f":"VLOOKUP(B32,Players!$C$2:$F$129,4,FALSE)","v":"Belgium"},{"$f":"VLOOKUP(B32,Players!$C$2:$F$129,3,FALSE)","v":"Chaos Pact"},{"$f":"FixturePaste!C31","v":"Balder "},{"$f":"VLOOKUP(E32,Players!$C$2:$F$129,4,FALSE)","v":"Viking"},{"$f":"VLOOKUP(E32,Players!$C$2:$F$129,3,FALSE)","v":"Dark Elves"}]
[31,{"$f":"FixturePaste!B32","v":"Phoenix11 "},{"$f":"VLOOKUP(B33,Players!$C$2:$F$129,4,FALSE)","v":"Belgium"},{"$f":"VLOOKUP(B33,Players!$C$2:$F$129,3,FALSE)","v":"Dark Elves"},{"$f":"FixturePaste!C32","v":"Corwin "},{"$f":"VLOOKUP(E33,Players!$C$2:$F$129,4,FALSE)","v":"Viking"},{"$f":"VLOOKUP(E33,Players!$C$2:$F$129,3,FALSE)","v":"Chaos Pact"}]
[32,{"$f":"FixturePaste!B33","v":"Woete "},{"$f":"VLOOKUP(B34,Players!$C$2:$F$129,4,FALSE)","v":"Belgium"},{"$f":"VLOOKUP(B34,Players!$C$2:$F$129,3,FALSE)","v":"Chaos Dwarves"},{"$f":"FixturePaste!C33","v":"Faccko "},{"$f":"VLOOKUP(E34,Players!$C$2:$F$129,4,FALSE)","v":"Viking"},{"$f":"VLOOKUP(E34,Players!$C$2:$F$129,3,FALSE)","v":"Dwarves"}]
[33,{"$f":"FixturePaste!B34","v":"Dionysian "},{"$f":"VLOOKUP(B35,Players!$C$2:$F$129,4,FALSE)","v":"Wales"},{"$f":"VLOOKUP(B35,Players!$C$2:$F$129,3,FALSE)","v":"Dark Elves"},{"$f":"FixturePaste!C34","v":"Obeliz "},{"$f":"VLOOKUP(E35,Players!$C$2:$F$129,4,FALSE)","v":"Spain"},{"$f":"VLOOKUP(E35,Players!$C$2:$F$129,3,FALSE)","v":"Chaos"}]
[34,{"$f":"FixturePaste!B35","v":"SFisher91 "},{"$f":"VLOOKUP(B36,Players!$C$2:$F$129,4,FALSE)","v":"Wales"},{"$f":"VLOOKUP(B36,Players!$C$2:$F$129,3,FALSE)","v":"Chaos Pact"},{"$f":"FixturePaste!C35","v":"Barry "},{"$f":"VLOOKUP(E36,Players!$C$2:$F$129,4,FALSE)","v":"Spain"},{"$f":"VLOOKUP(E36,Players!$C$2:$F$129,3,FALSE)","v":"High Elves"}]
[35,{"$f":"FixturePaste!B36","v":"Ploppy_McPloppy "},{"$f":"VLOOKUP(B37,Players!$C$2:$F$129,4,FALSE)","v":"Wales"},{"$f":"VLOOKUP(B37,Players!$C$2:$F$129,3,FALSE)","v":"Slann"},{"$f":"FixturePaste!C36","v":"Malasnoticias "},{"$f":"VLOOKUP(E37,Players!$C$2:$F$129,4,FALSE)","v":"Spain"},{"$f":"VLOOKUP(E37,Players!$C$2:$F$129,3,FALSE)","v":"Chaos Pact"}]
[36,{"$f":"FixturePaste!B37","v":"20Phoenix "},{"$f":"VLOOKUP(B38,Players!$C$2:$F$129,4,FALSE)","v":"Wales"},{"$f":"VLOOKUP(B38,Players!$C$2:$F$129,3,FALSE)","v":"Chaos Dwarves"},{"$f":"FixturePaste!C37","v":"Tactel "},{"$f":"VLOOKUP(E38,Players!$C$2:$F$129,4,FALSE)","v":"Spain"},{"$f":"VLOOKUP(E38,Players!$C$2:$F$129,3,FALSE)","v":"High Elves"}]
[37,{"$f":"FixturePaste!B38","v":"andydavo "},{"$f":"VLOOKUP(B39,Players!$C$2:$F$129,4,FALSE)","v":"Wales"},{"$f":"VLOOKUP(B39,Players!$C$2:$F$129,3,FALSE)","v":"Ogres"},{"$f":"FixturePaste!C38","v":"Dark Duke "},{"$f":"VLOOKUP(E39,Players!$C$2:$F$129,4,FALSE)","v":"Spain"},{"$f":"VLOOKUP(E39,Players!$C$2:$F$129,3,FALSE)","v":"Chaos Dwarves"}]
[38,{"$f":"FixturePaste!B39","v":"MadeofWelsh "},{"$f":"VLOOKUP(B40,Players!$C$2:$F$129,4,FALSE)","v":"Wales"},{"$f":"VLOOKUP(B40,Players!$C$2:$F$129,3,FALSE)","v":"Lizardmen"},{"$f":"FixturePaste!C39","v":"Joanet "},{"$f":"VLOOKUP(E40,Players!$C$2:$F$129,4,FALSE)","v":"Spain"},{"$f":"VLOOKUP(E40,Players!$C$2:$F$129,3,FALSE)","v":"Khemri"}]
[39,{"$f":"FixturePaste!B40","v":"Northernknight "},{"$f":"VLOOKUP(B41,Players!$C$2:$F$129,4,FALSE)","v":"Wales"},{"$f":"VLOOKUP(B41,Players!$C$2:$F$129,3,FALSE)","v":"Chaos"},{"$f":"FixturePaste!C40","v":"Duke_Luthor_Von_Hawkfire "},{"$f":"VLOOKUP(E41,Players!$C$2:$F$129,4,FALSE)","v":"Spain"},{"$f":"VLOOKUP(E41,Players!$C$2:$F$129,3,FALSE)","v":"Vampires"}]
[40,{"$f":"FixturePaste!B41","v":"nonumber "},{"$f":"VLOOKUP(B42,Players!$C$2:$F$129,4,FALSE)","v":"Wales"},{"$f":"VLOOKUP(B42,Players!$C$2:$F$129,3,FALSE)","v":"Skaven"},{"$f":"FixturePaste!C41","v":"Idroj "},{"$f":"VLOOKUP(E42,Players!$C$2:$F$129,4,FALSE)","v":"Spain"},{"$f":"VLOOKUP(E42,Players!$C$2:$F$129,3,FALSE)","v":"Dwarves"}]
[41,{"$f":"FixturePaste!B42","v":"Matte8 "},{"$f":"VLOOKUP(B43,Players!$C$2:$F$129,4,FALSE)","v":"Italy"},{"$f":"VLOOKUP(B43,Players!$C$2:$F$129,3,FALSE)","v":"Khemri"},{"$f":"FixturePaste!C42","v":"Jaqra "},{"$f":"VLOOKUP(E43,Players!$C$2:$F$129,4,FALSE)","v":"Denmark"},{"$f":"VLOOKUP(E43,Players!$C$2:$F$129,3,FALSE)","v":"Skaven"}]
[42,{"$f":"FixturePaste!B43","v":"Kaltenland "},{"$f":"VLOOKUP(B44,Players!$C$2:$F$129,4,FALSE)","v":"Italy"},{"$f":"VLOOKUP(B44,Players!$C$2:$F$129,3,FALSE)","v":"Chaos Pact"},{"$f":"FixturePaste!C43","v":"Niebling "},{"$f":"VLOOKUP(E44,Players!$C$2:$F$129,4,FALSE)","v":"Denmark"},{"$f":"VLOOKUP(E44,Players!$C$2:$F$129,3,FALSE)","v":"Amazons"}]
[43,{"$f":"FixturePaste!B44","v":"Verrinho "},{"$f":"VLOOKUP(B45,Players!$C$2:$F$129,4,FALSE)","v":"Italy"},{"$f":"VLOOKUP(B45,Players!$C$2:$F$129,3,FALSE)","v":"Nurgle's Rotters"},{"$f":"FixturePaste!C44","v":"Tank "},{"$f":"VLOOKUP(E45,Players!$C$2:$F$129,4,FALSE)","v":"Denmark"},{"$f":"VLOOKUP(E45,Players!$C$2:$F$129,3,FALSE)","v":"Necromantic"}]
[44,{"$f":"FixturePaste!B45","v":"Dirold "},{"$f":"VLOOKUP(B46,Players!$C$2:$F$129,4,FALSE)","v":"Italy"},{"$f":"VLOOKUP(B46,Players!$C$2:$F$129,3,FALSE)","v":"Amazons"},{"$f":"FixturePaste!C45","v":"MissSweden "},{"$f":"VLOOKUP(E46,Players!$C$2:$F$129,4,FALSE)","v":"Denmark"},{"$f":"VLOOKUP(E46,Players!$C$2:$F$129,3,FALSE)","v":"Chaos"}]
[45,{"$f":"FixturePaste!B46","v":"Farina "},{"$f":"VLOOKUP(B47,Players!$C$2:$F$129,4,FALSE)","v":"Italy"},{"$f":"VLOOKUP(B47,Players!$C$2:$F$129,3,FALSE)","v":"Chaos Dwarves"},{"$f":"FixturePaste!C46","v":"Tripleskull "},{"$f":"VLOOKUP(E47,Players!$C$2:$F$129,4,FALSE)","v":"Denmark"},{"$f":"VLOOKUP(E47,Players!$C$2:$F$129,3,FALSE)","v":"Chaos"}]
[46,{"$f":"FixturePaste!B47","v":"Beppe "},{"$f":"VLOOKUP(B48,Players!$C$2:$F$129,4,FALSE)","v":"Italy"},{"$f":"VLOOKUP(B48,Players!$C$2:$F$129,3,FALSE)","v":"Orc"},{"$f":"FixturePaste!C47","v":"Topper "},{"$f":"VLOOKUP(E48,Players!$C$2:$F$129,4,FALSE)","v":"Denmark"},{"$f":"VLOOKUP(E48,Players!$C$2:$F$129,3,FALSE)","v":"Chaos"}]
[47,{"$f":"FixturePaste!B48","v":"Liam "},{"$f":"VLOOKUP(B49,Players!$C$2:$F$129,4,FALSE)","v":"Italy"},{"$f":"VLOOKUP(B49,Players!$C$2:$F$129,3,FALSE)","v":"Wood Elves"},{"$f":"FixturePaste!C48","v":"SpecialOne "},{"$f":"VLOOKUP(E49,Players!$C$2:$F$129,4,FALSE)","v":"Denmark"},{"$f":"VLOOKUP(E49,Players!$C$2:$F$129,3,FALSE)","v":"Lizardmen"}]
[48,{"$f":"FixturePaste!B49","v":"Spartako "},{"$f":"VLOOKUP(B50,Players!$C$2:$F$129,4,FALSE)","v":"Italy"},{"$f":"VLOOKUP(B50,Players!$C$2:$F$129,3,FALSE)","v":"Skaven"},{"$f":"FixturePaste!C49","v":"kfoged "},{"$f":"VLOOKUP(E50,Players!$C$2:$F$129,4,FALSE)","v":"Denmark"},{"$f":"VLOOKUP(E50,Players!$C$2:$F$129,3,FALSE)","v":"Slann"}]
[49,{"$f":"FixturePaste!B50","v":"Simon_ACP "},{"$f":"VLOOKUP(B51,Players!$C$2:$F$129,4,FALSE)","v":"France"},{"$f":"VLOOKUP(B51,Players!$C$2:$F$129,3,FALSE)","v":"Humans"},{"$f":"FixturePaste!C50","v":"valkohukka "},{"$f":"VLOOKUP(E51,Players!$C$2:$F$129,4,FALSE)","v":"Finland"},{"$f":"VLOOKUP(E51,Players!$C$2:$F$129,3,FALSE)","v":"Slann"}]
[50,{"$f":"FixturePaste!B51","v":"Gros Nain "},{"$f":"VLOOKUP(B52,Players!$C$2:$F$129,4,FALSE)","v":"France"},{"$f":"VLOOKUP(B52,Players!$C$2:$F$129,3,FALSE)","v":"Norse"},{"$f":"FixturePaste!C51","v":"J-Ho"},{"$f":"VLOOKUP(E52,Players!$C$2:$F$129,4,FALSE)","v":"Finland"},{"$f":"VLOOKUP(E52,Players!$C$2:$F$129,3,FALSE)","v":"Nurgle's Rotters"}]
[51,{"$f":"FixturePaste!B52","v":"BiBi "},{"$f":"VLOOKUP(B53,Players!$C$2:$F$129,4,FALSE)","v":"France"},{"$f":"VLOOKUP(B53,Players!$C$2:$F$129,3,FALSE)","v":"Undead"},{"$f":"FixturePaste!C52","v":"BeerBeer "},{"$f":"VLOOKUP(E53,Players!$C$2:$F$129,4,FALSE)","v":"Finland"},{"$f":"VLOOKUP(E53,Players!$C$2:$F$129,3,FALSE)","v":"Necromantic"}]
[52,{"$f":"FixturePaste!B53","v":"Matt le fou "},{"$f":"VLOOKUP(B54,Players!$C$2:$F$129,4,FALSE)","v":"France"},{"$f":"VLOOKUP(B54,Players!$C$2:$F$129,3,FALSE)","v":"Undead"},{"$f":"FixturePaste!C53","v":"jopotzuki "},{"$f":"VLOOKUP(E54,Players!$C$2:$F$129,4,FALSE)","v":"Finland"},{"$f":"VLOOKUP(E54,Players!$C$2:$F$129,3,FALSE)","v":"Nurgle's Rotters"}]
[53,{"$f":"FixturePaste!B54","v":"Harti "},{"$f":"VLOOKUP(B55,Players!$C$2:$F$129,4,FALSE)","v":"France"},{"$f":"VLOOKUP(B55,Players!$C$2:$F$129,3,FALSE)","v":"Skaven"},{"$f":"FixturePaste!C54","v":"MacWitt "},{"$f":"VLOOKUP(E55,Players!$C$2:$F$129,4,FALSE)","v":"Finland"},{"$f":"VLOOKUP(E55,Players!$C$2:$F$129,3,FALSE)","v":"Elves"}]
[54,{"$f":"FixturePaste!B55","v":"BudWiser "},{"$f":"VLOOKUP(B56,Players!$C$2:$F$129,4,FALSE)","v":"France"},{"$f":"VLOOKUP(B56,Players!$C$2:$F$129,3,FALSE)","v":"Necromantic"},{"$f":"FixturePaste!C55","v":"Harza "},{"$f":"VLOOKUP(E56,Players!$C$2:$F$129,4,FALSE)","v":"Finland"},{"$f":"VLOOKUP(E56,Players!$C$2:$F$129,3,FALSE)","v":"Dwarves"}]
[55,{"$f":"FixturePaste!B56","v":"Justicium "},{"$f":"VLOOKUP(B57,Players!$C$2:$F$129,4,FALSE)","v":"France"},{"$f":"VLOOKUP(B57,Players!$C$2:$F$129,3,FALSE)","v":"Wood Elves"},{"$f":"FixturePaste!C56","v":"edheim "},{"$f":"VLOOKUP(E57,Players!$C$2:$F$129,4,FALSE)","v":"Finland"},{"$f":"VLOOKUP(E57,Players!$C$2:$F$129,3,FALSE)","v":"Chaos"}]
[56,{"$f":"FixturePaste!B57","v":"Bouzzy "},{"$f":"VLOOKUP(B58,Players!$C$2:$F$129,4,FALSE)","v":"France"},{"$f":"VLOOKUP(B58,Players!$C$2:$F$129,3,FALSE)","v":"Chaos Pact"},{"$f":"FixturePaste!C57","v":"ratogre "},{"$f":"VLOOKUP(E58,Players!$C$2:$F$129,4,FALSE)","v":"Finland"},{"$f":"VLOOKUP(E58,Players!$C$2:$F$129,3,FALSE)","v":"Necromantic"}]
[57,{"$f":"FixturePaste!B58","v":"BlackOrc "},{"$f":"VLOOKUP(B59,Players!$C$2:$F$129,4,FALSE)","v":"Hungary"},{"$f":"VLOOKUP(B59,Players!$C$2:$F$129,3,FALSE)","v":"Chaos Pact"},{"$f":"FixturePaste!C58","v":"Candlejack "},{"$f":"VLOOKUP(E59,Players!$C$2:$F$129,4,FALSE)","v":"Germany"},{"$f":"VLOOKUP(E59,Players!$C$2:$F$129,3,FALSE)","v":"Undead"}]
[58,{"$f":"FixturePaste!B59","v":"noraal "},{"$f":"VLOOKUP(B60,Players!$C$2:$F$129,4,FALSE)","v":"Hungary"},{"$f":"VLOOKUP(B60,Players!$C$2:$F$129,3,FALSE)","v":"Underworld"},{"$f":"FixturePaste!C59","v":"Jonny_Kanone "},{"$f":"VLOOKUP(E60,Players!$C$2:$F$129,4,FALSE)","v":"Germany"},{"$f":"VLOOKUP(E60,Players!$C$2:$F$129,3,FALSE)","v":"Chaos Dwarves"}]
[59,{"$f":"FixturePaste!B60","v":"Alex05 "},{"$f":"VLOOKUP(B61,Players!$C$2:$F$129,4,FALSE)","v":"Hungary"},{"$f":"VLOOKUP(B61,Players!$C$2:$F$129,3,FALSE)","v":"Orc"},{"$f":"FixturePaste!C60","v":"DocMaxx "},{"$f":"VLOOKUP(E61,Players!$C$2:$F$129,4,FALSE)","v":"Germany"},{"$f":"VLOOKUP(E61,Players!$C$2:$F$129,3,FALSE)","v":"Chaos Pact"}]
[60,{"$f":"FixturePaste!B61","v":"Itzla "},{"$f":"VLOOKUP(B62,Players!$C$2:$F$129,4,FALSE)","v":"Hungary"},{"$f":"VLOOKUP(B62,Players!$C$2:$F$129,3,FALSE)","v":"Chaos Dwarves"},{"$f":"FixturePaste!C61","v":"Muadib "},{"$f":"VLOOKUP(E62,Players!$C$2:$F$129,4,FALSE)","v":"Germany"},{"$f":"VLOOKUP(E62,Players!$C$2:$F$129,3,FALSE)","v":"Khemri"}]
[61,{"$f":"FixturePaste!B62","v":"Wolio "},{"$f":"VLOOKUP(B63,Players!$C$2:$F$129,4,FALSE)","v":"Hungary"},{"$f":"VLOOKUP(B63,Players!$C$2:$F$129,3,FALSE)","v":"Dark Elves"},{"$f":"FixturePaste!C62","v":"Arioso "},{"$f":"VLOOKUP(E63,Players!$C$2:$F$129,4,FALSE)","v":"Germany"},{"$f":"VLOOKUP(E63,Players!$C$2:$F$129,3,FALSE)","v":"Orc"}]
[62,{"$f":"FixturePaste!B63","v":"Favi "},{"$f":"VLOOKUP(B64,Players!$C$2:$F$129,4,FALSE)","v":"Hungary"},{"$f":"VLOOKUP(B64,Players!$C$2:$F$129,3,FALSE)","v":"Skaven"},{"$f":"FixturePaste!C63","v":"Gaunab "},{"$f":"VLOOKUP(E64,Players!$C$2:$F$129,4,FALSE)","v":"Germany"},{"$f":"VLOOKUP(E64,Players!$C$2:$F$129,3,FALSE)","v":"Orc"}]
[63,{"$f":"FixturePaste!B64","v":"swifty "},{"$f":"VLOOKUP(B65,Players!$C$2:$F$129,4,FALSE)","v":"Hungary"},{"$f":"VLOOKUP(B65,Players!$C$2:$F$129,3,FALSE)","v":"Khemri"},{"$f":"FixturePaste!C64","v":"Prince "},{"$f":"VLOOKUP(E65,Players!$C$2:$F$129,4,FALSE)","v":"Germany"},{"$f":"VLOOKUP(E65,Players!$C$2:$F$129,3,FALSE)","v":"Lizardmen"}]
[64,{"$f":"FixturePaste!B65","v":"cz "},{"$f":"VLOOKUP(B66,Players!$C$2:$F$129,4,FALSE)","v":"Hungary"},{"$f":"VLOOKUP(B66,Players!$C$2:$F$129,3,FALSE)","v":"Underworld"},{"$f":"FixturePaste!C65","v":"RoterSternHochdah "},{"$f":"VLOOKUP(E66,Players!$C$2:$F$129,4,FALSE)","v":"Germany"},{"$f":"VLOOKUP(E66,Players!$C$2:$F$129,3,FALSE)","v":"Chaos Dwarves"}]

{"sheet":"Buttons","index":4,"n_rows":0,"n_cols":0,"rows_kept":0,"cut":false,"hidden":false,"merged":[]}