{"text_format":"1","workbook":"xlsx","n_sheets":5,"sheets":["Players","FixturePaste","PrintOut","Display","Buttons"],"not_rendered":{"charts":0,"images":0,"macros":1,"external_links":1,"defined_names":3,"comments":1,"pivot_tables":0},"unopened":[],"bounds":{"document_bytes":16777216,"sheet_cells":100000,"rows_first":2000,"rows_last":500,"rows_between":2000,"halvings":0,"cell_chars":16384,"cell_head_chars":4096},"cells_cut":0,"cells_raw":0,"read":"whole","date_system":"1900"}

{"sheet":"Players","index":0,"n_rows":129,"n_cols":6,"rows_kept":129,"cut":false,"hidden":false,"merged":[]}
["Num","Display Name","NAF Name","NAF Number (Random)","Race","Group"]
[{"$f":"IF(C2=\"\",\"\",MAX(A$1:A1)+1)","v":1},"Driesfield ","Driesfield ",6183,"Slann","Belgium"]
[{"$f":"IF(C3=\"\",\"\",MAX(A$1:A2)+1)","v":2},"Malodoror ","Malodoror ",20793,"Chaos Pact","Belgium"]
[{"$f":"IF(C4=\"\",\"\",MAX(A$1:A3)+1)","v":3},"JJ ","JJ ",10488,"Underworld","Belgium"]
[{"$f":"IF(C5=\"\",\"\",MAX(A$1:A4)+1)","v":4},"Araznaroth ","Araznaroth ",13199,"Goblins","Belgium"]
[{"$f":"IF(C6=\"\",\"\",MAX(A$1:A5)+1)","v":5},"Woete ","Woete ",12500,"Chaos Dwarves","Belgium"]
[{"$f":"IF(C7=\"\",\"\",MAX(A$1:A6)+1)","v":6},"gninocker ","gninocker ",17832,"Vampires","Belgium"]
[{"$f":"IF(C8=\"\",\"\",MAX(A$1:A7)+1)","v":7},"Phoenix11 ","Phoenix11 ",8402,"Dark Elves","Belgium"]
[{"$f":"IF(C9=\"\",\"\",MAX(A$1:A8)+1)","v":8},"Dekra1979 ","Dekra1979 ",16259,"High Elves","Belgium"]
[{"$f":"IF(C10=\"\",\"\",MAX(A$1:A9)+1)","v":9},"Tripleskull ","Tripleskull ",9524,"Chaos","Denmark"]
[{"$f":"IF(C11=\"\",\"\",MAX(A$1:A10)+1)","v":10},"MissSweden ","MissSweden ",11498,"Chaos","Denmark"]
[{"$f":"IF(C12=\"\",\"\",MAX(A$1:A11)+1)","v":11},"kfoged ","kfoged ",10691,"Slann","Denmark"]
[{"$f":"IF(C13=\"\",\"\",MAX(A$1:A12)+1)","v":12},"Tank ","Tank ",11501,"Necromantic","Denmark"]
[{"$f":"IF(C14=\"\",\"\",MAX(A$1:A13)+1)","v":13},"Topper ","Topper ",6363,"Chaos","Denmark"]
[{"$f":"IF(C15=\"\",\"\",MAX(A$1:A14)+1)","v":14},"SpecialOne ","SpecialOne ",16742,"Lizardmen","Denmark"]
[{"$f":"IF(C16=\"\",\"\",MAX(A$1:A15)+1)","v":15},"Jaqra ","Jaqra ",19750,"Skaven","Denmark"]
[{"$f":"IF(C17=\"\",\"\",MAX(A$1:A16)+1)","v":16},"Niebling ","Niebling ",11499,"Amazons","Denmark"]
[{"$f":"IF(C18=\"\",\"\",MAX(A$1:A17)+1)","v":17},"Lycos ","Lycos ",2870,"Ogres","England"]
[{"$f":"IF(C19=\"\",\"\",MAX(A$1:A18)+1)","v":18},"PurpleGoo ","PurpleGoo ",11777,"Amazons","England"]
[{"$f":"IF(C20=\"\",\"\",MAX(A$1:A19)+1)","v":19},"Geggster ","Geggster ",70,"Orc","England"]
[{"$f":"IF(C21=\"\",\"\",MAX(A$1:A20)+1)","v":20},"Podfrey ","Podfrey ",149,"Slann","England"]
[{"$f":"IF(C22=\"\",\"\",MAX(A$1:A21)+1)","v":21},"JimJimany ","JimJimany ",12403,"Goblins","England"]
[{"$f":"IF(C23=\"\",\"\",MAX(A$1:A22)+1)","v":22},"Joemanji ","Joemanji ",3312,"Chaos","England"]
[{"$f":"IF(C24=\"\",\"\",MAX(A$1:A23)+1)","v":23},"Mubo ","Mubo ",13409,"Amazons","England"]
[{"$f":"IF(C25=\"\",\"\",MAX(A$1:A24)+1)","v":24},"Wilzif ","Wilzif ",8901,"Underworld","England"]
[{"$f":"IF(B26=\"\",\"\",MAX(A$1:A25)+1)","v":25},"MacWitt ","MacWitt ",19932,"Elves","Finland"]
[{"$f":"IF(B27=\"\",\"\",MAX(A$1:A26)+1)","v":26},"Harza ","Harza ",20060,"Dwarves","Finland"]
[{"$f":"IF(B28=\"\",\"\",MAX(A$1:A27)+1)","v":27},"jopotzuki ","jopotzuki ",20783,"Nurgle's Rotters","Finland"]
[{"$f":"IF(B29=\"\",\"\",MAX(A$1:A28)+1)","v":28},"edheim ","edheim ",20760,"Chaos","Finland"]
[{"$f":"IF(B30=\"\",\"\",MAX(A$1:A29)+1)","v":29},"BeerBeer ","BeerBeer ",18245,"Necromantic","Finland"]
[{"$f":"IF(B31=\"\",\"\",MAX(A$1:A30)+1)","v":30},"J-Ho","J-Ho",19106,"Nurgle's Rotters","Finland"]
[{"$f":"IF(B32=\"\",\"\",MAX(A$1:A31)+1)","v":31},"ratogre ","ratogre ",22007,"Necromantic","Finland"]
[{"$f":"IF(B33=\"\",\"\",MAX(A$1:A32)+1)","v":32},"valkohukka ","valkohukka ",18772,"Slann","Finland"]
[{"$f":"IF(B34=\"\",\"\",MAX(A$1:A33)+1)","v":33},"BiBi ","BiBi ",11491,"Undead","France"]
[{"$f":"IF(B35=\"\",\"\",MAX(A$1:A34)+1)","v":34},"Bouzzy ","Bouzzy ",15733,"Chaos Pact","France"]
[{"$f":"IF(B36=\"\",\"\",MAX(A$1:A35)+1)","v":35},"BudWiser ","BudWiser ",12987,"Necromantic","France"]
[{"$f":"IF(B37=\"\",\"\",MAX(A$1:A36)+1)","v":36},"Gros Nain ","Gros Nain ",14524,"Norse","France"]
[{"$f":"IF(B38=\"\",\"\",MAX(A$1:A37)+1)","v":37},"Harti ","Harti ",13583,"Skaven","France"]
[{"$f":"IF(B39=\"\",\"\",MAX(A$1:A38)+1)","v":38},"Justicium ","Justicium ",12319,"Wood Elves","France"]
[{"$f":"IF(B40=\"\",\"\",MAX(A$1:A39)+1)","v":39},"Matt le fou ","Matt le fou ",13561,"Undead","France"]
{"$rows_left_out":90}
{"sheet":"FixturePaste","index":1,"n_rows":65,"n_cols":3,"rows_kept":65,"cut":false,"hidden":false,"merged":[]}
["Table","Home Player","Away Player"]
[1,"Pellevin ","Domingo "]
[{"$f":"A2+1","v":2},"Dragons ","Mewash "]
[{"$f":"A3+1","v":3},"Inforthepain ","Reszka "]
[4,"Skoberget ","Leonek "]
[5,"JohnnyD ","Slimaq "]
[6,"Melisqus ","Warrior1980 "]
[7,"Skuld ","Juniooor7 "]
[8,"Pidpad ","Shawass "]
[9,"The_Ref ","Joemanji "]
[10,"straume ","Geggster "]
[11,"GreatWhiteHope ","PurpleGoo "]
[12,"mynock ","Wilzif "]
[13,"FrankPedersen ","JimJimany "]
[14,"zulu ","Lycos "]
[15,"Endalos ","Podfrey "]
[16,"bothun ","Mubo "]
[17,"Purdindas ","Jokaero "]
[18,"Garrick ","Phifoe "]
[19,"DonShula ","Macabeo "]
[20,"sann0638 ","Madmatt13 "]
[21,"Loki ","Strider84 "]
[22,"JamesEs ","sigu70 "]
[23,"Valen ","Elrik "]
[24,"HumptyTrump ","Goss "]
[25,"Araznaroth ","Purrelito "]
[26,"Dekra1979 ","brocCooli "]
[27,"Driesfield ","Mufflo "]
[28,"JJ ","Duckwing "]
[29,"gninocker ","Bernuz "]
[30,"Malodoror ","Balder "]
[31,"Phoenix11 ","Corwin "]
[32,"Woete ","Faccko "]
[33,"Dionysian ","Obeliz "]
[34,"SFisher91 ","Barry "]
[35,"Ploppy_McPloppy ","Malasnoticias "]
[36,"20Phoenix ","Tactel "]
[37,"andydavo ","Dark Duke "]
[38,"MadeofWelsh ","Joanet "]
[39,"Northernknight ","Duke_Luthor_Von_Hawkfire "]
{"$rows_left_out":26}
{"sheet":"PrintOut","index":2,"n_rows":65,"n_cols":7,"rows_kept":65,"cut":false,"hidden":false,"merged":[]}
["Table","Home Player","Away Player","Home TD","Away TD","Home Cas","Away Cas"]
[1,"Pellevin ","Domingo "]
[{"$f":"A2+1","v":2},"Dragons ","Mewash "]
[{"$f":"A3+1","v":3},"Inforthepain ","Reszka "]
[4,"Skoberget ","Leonek "]
[5,"JohnnyD ","Slimaq "]
[6,"Melisqus ","Warrior1980 "]
[7,"Skuld ","Juniooor7 "]
[8,"Pidpad ","Shawass "]
[9,"The_Ref ","Joemanji "]
[10,"straume ","Geggster "]
[11,"GreatWhiteHope ","PurpleGoo "]
[12,"mynock ","Wilzif "]
[13,"FrankPedersen ","JimJimany "]
[14,"zulu ","Lycos "]
[15,"Endalos ","Podfrey "]
[16,"bothun ","Mubo "]
[17,"Purdindas ","Jokaero "]
[18,"Garrick ","Phifoe "]
[19,"DonShula ","Macabeo "]
[20,"sann0638 ","Madmatt13 "]
[21,"Loki ","Strider84 "]
[22,"JamesEs ","sigu70 "]
[23,"Valen ","Elrik "]
[24,"HumptyTrump ","Goss "]
[25,"Araznaroth ","Purrelito "]
[26,"Dekra1979 ","brocCooli "]
[27,"Driesfield ","Mufflo "]
[28,"JJ ","Duckwing "]
[29,"gninocker ","Bernuz "]
[30,"Malodoror ","Balder "]
[31,"Phoenix11 ","Corwin "]
[32,"Woete ","Faccko "]
[33,"Dionysian ","Obeliz "]
[34,"SFisher91 ","Barry "]
[35,"Ploppy_McPloppy ","Malasnoticias "]
[36,"20Phoenix ","Tactel "]
[37,"andydavo ","Dark Duke "]
[38,"MadeofWelsh ","Joanet "]
[39,"Northernknight ","Duke_Luthor_Von_Hawkfire "]
{"$rows_left_out":26}
{"sheet":"Display","index":3,"n_rows":66,"n_cols":7,"rows_kept":66,"cut":false,"hidden":false,"merged":[[0,1,0,3],[0,4,0,6]]}
[null,"Home",null,null,"Away"]
["Table","Player","Country","Race","Player","Country","Race"]
[1,{"$f":"FixturePaste!B2","v":"Pellevin "},{"$f":"VLOOKUP(B3,Players!$C$2:$F$129,4,FALSE)","v":"Sweden"},{"$f":"VLOOKUP(B3,Players!$C$2:$F$129,3,FALSE)","v":"Elves"},{"$f":"FixturePaste!C2","v":"Domingo "},{"$f":"VLOOKUP(E3,Players!$C$2:$F$129,4,FALSE)","v":"Poland"},{"$f":"VLOOKUP(E3,Players!$C$2:$F$129,3,FALSE)","v":"Ogres"}]
[2,{"$f":"FixturePaste!B3","v":"Dragons "},{"$f":"VLOOKUP(B4,Players!$C$2:$F$129,4,FALSE)","v":"Sweden"},{"$f":"VLOOKUP(B4,Players!$C$2:$F$129,3,FALSE)","v":"Orc"},{"$f":"FixturePaste!C3","v":"Mewash "},{"$f":"VLOOKUP(E4,Players!$C$2:$F$129,4,FALSE)","v":"Poland"},{"$f":"VLOOKUP(E4,Players!$C$2:$F$129,3,FALSE)","v":"Vampires"}]
[3,{"$f":"FixturePaste!B4","v":"Inforthepain "},{"$f":"VLOOKUP(B5,Players!$C$2:$F$129,4,FALSE)","v":"Sweden"},{"$f":"VLOOKUP(B5,Players!$C$2:$F$129,3,FALSE)","v":"Wood Elves"},{"$f":"FixturePaste!C4","v":"Reszka "},{"$f":"VLOOKUP(E5,Players!$C$2:$F$129,4,FALSE)","v":"Poland"},{"$f":"VLOOKUP(E5,Players!$C$2:$F$129,3,FALSE)","v":"Dark Elves"}]
[4,{"$f":"FixturePaste!B5","v":"Skoberget "},{"$f":"VLOOKUP(B6,Players!$C$2:$F$129,4,FALSE)","v":"Sweden"},{"$f":"VLOOKUP(B6,Players!$C$2:$F$129,3,FALSE)","v":"Slann"},{"$f":"FixturePaste!C5","v":"Leonek "},{"$f":"VLOOKUP(E6,Players!$C$2:$F$129,4,FALSE)","v":"Poland"},{"$f":"VLOOKUP(E6,Players!$C$2:$F$129,3,FALSE)","v":"Vampires"}]
[5,{"$f":"FixturePaste!B6","v":"JohnnyD "},{"$f":"VLOOKUP(B7,Players!$C$2:$F$129,4,FALSE)","v":"Sweden"},{"$f":"VLOOKUP(B7,Players!$C$2:$F$129,3,FALSE)","v":"Halflings"},{"$f":"FixturePaste!C6","v":"Slimaq "},{"$f":"VLOOKUP(E7,Players!$C$2:$F$129,4,FALSE)","v":"Poland"},{"$f":"VLOOKUP(E7,Players!$C$2:$F$129,3,FALSE)","v":"Dark Elves"}]
[6,{"$f":"FixturePaste!B7","v":"Melisqus "},{"$f":"VLOOKUP(B8,Players!$C$2:$F$129,4,FALSE)","v":"Sweden"},{"$f":"VLOOKUP(B8,Players!$C$2:$F$129,3,FALSE)","v":"Orc"},{"$f":"FixturePaste!C7","v":"Warrior1980 "},{"$f":"VLOOKUP(E8,Players!$C$2:$F$129,4,FALSE)","v":"Poland"},{"$f":"VLOOKUP(E8,Players!$C$2:$F$129,3,FALSE)","v":"Norse"}]
[7,{"$f":"FixturePaste!B8","v":"Skuld "},{"$f":"VLOOKUP(B9,Players!$C$2:$F$129,4,FALSE)","v":"Sweden"},{"$f":"VLOOKUP(B9,Players!$C$2:$F$129,3,FALSE)","v":"Dark Elves"},{"$f":"FixturePaste!C8","v":"Juniooor7 "},{"$f":"VLOOKUP(E9,Players!$C$2:$F$129,4,FALSE)","v":"Poland"},{"$f":"VLOOKUP(E9,Players!$C$2:$F$129,3,FALSE)","v":"Norse"}]
[8,{"$f":"FixturePaste!B9","v":"Pidpad "},{"$f":"VLOOKUP(B10,Players!$C$2:$F$129,4,FALSE)","v":"Sweden"},{"$f":"VLOOKUP(B10,Players!$C$2:$F$129,3,FALSE)","v":"High Elves"},{"$f":"FixturePaste!C9","v":"Shawass "},{"$f":"VLOOKUP(E10,Players!$C$2:$F$129,4,FALSE)","v":"Poland"},{"$f":"VLOOKUP(E10,Players!$C$2:$F$129,3,FALSE)","v":"Chaos Pact"}]
[9,{"$f":"FixturePaste!B10","v":"The_Ref "},{"$f":"VLOOKUP(B11,Players!$C$2:$F$129,4,FALSE)","v":"Norway"},{"$f":"VLOOKUP(B11,Players!$C$2:$F$129,3,FALSE)","v":"Amazons"},{"$f":"FixturePaste!C10","v":"Joemanji "},{"$f":"VLOOKUP(E11,Players!$C$2:$F$129,4,FALSE)","v":"England"},{"$f":"VLOOKUP(E11,Players!$C$2:$F$129,3,FALSE)","v":"Chaos"}]
[10,{"$f":"FixturePaste!B11","v":"straume "},{"$f":"VLOOKUP(B12,Players!$C$2:$F$129,4,FALSE)","v":"Norway"},{"$f":"VLOOKUP(B12,Players!$C$2:$F$129,3,FALSE)","v":"High Elves"},{"$f":"FixturePaste!C11","v":"Geggster "},{"$f":"VLOOKUP(E12,Players!$C$2:$F$129,4,FALSE)","v":"England"},{"$f":"VLOOKUP(E12,Players!$C$2:$F$129,3,FALSE)","v":"Orc"}]
[11,{"$f":"FixturePaste!B12","v":"GreatWhiteHope "},{"$f":"VLOOKUP(B13,Players!$C$2:$F$129,4,FALSE)","v":"Norway"},{"$f":"VLOOKUP(B13,Players!$C$2:$F$129,3,FALSE)","v":"Lizardmen"},{"$f":"FixturePaste!C12","v":"PurpleGoo "},{"$f":"VLOOKUP(E13,Players!$C$2:$F$129,4,FALSE)","v":"England"},{"$f":"VLOOKUP(E13,Players!$C$2:$F$129,3,FALSE)","v":"Amazons"}]
[12,{"$f":"FixturePaste!B13","v":"mynock "},{"$f":"VLOOKUP(B14,Players!$C$2:$F$129,4,FALSE)","v":"Norway"},{"$f":"VLOOKUP(B14,Players!$C$2:$F$129,3,FALSE)","v":"Goblins"},{"$f":"FixturePaste!C13","v":"Wilzif "},{"$f":"VLOOKUP(E14,Players!$C$2:$F$129,4,FALSE)","v":"England"},{"$f":"VLOOKUP(E14,Players!$C$2:$F$129,3,FALSE)","v":"Underworld"}]
[13,{"$f":"FixturePaste!B14","v":"FrankPedersen "},{"$f":"VLOOKUP(B15,Players!$C$2:$F$129,4,FALSE)","v":"Norway"},{"$f":"VLOOKUP(B15,Players!$C$2:$F$129,3,FALSE)","v":"Chaos"},{"$f":"FixturePaste!C14","v":"JimJimany "},{"$f":"VLOOKUP(E15,Players!$C$2:$F$129,4,FALSE)","v":"England"},{"$f":"VLOOKUP(E15,Players!$C$2:$F$129,3,FALSE)","v":"Goblins"}]
[14,{"$f":"FixturePaste!B15","v":"zulu "},{"$f":"VLOOKUP(B16,Players!$C$2:$F$129,4,FALSE)","v":"Norway"},{"$f":"VLOOKUP(B16,Players!$C$2:$F$129,3,FALSE)","v":"Goblins"},{"$f":"FixturePaste!C15","v":"Lycos "},{"$f":"VLOOKUP(E16,Players!$C$2:$F$129,4,FALSE)","v":"England"},{"$f":"VLOOKUP(E16,Players!$C$2:$F$129,3,FALSE)","v":"Ogres"}]
[15,{"$f":"FixturePaste!B16","v":"Endalos "},{"$f":"VLOOKUP(B17,Players!$C$2:$F$129,4,FALSE)","v":"Norway"},{"$f":"VLOOKUP(B17,Players!$C$2:$F$129,3,FALSE)","v":"Wood Elves"},{"$f":"FixturePaste!C16","v":"Podfrey "},{"$f":"VLOOKUP(E17,Players!$C$2:$F$129,4,FALSE)","v":"England"},{"$f":"VLOOKUP(E17,Players!$C$2:$F$129,3,FALSE)","v":"Slann"}]
[16,{"$f":"FixturePaste!B17","v":"bothun "},{"$f":"VLOOKUP(B18,Players!$C$2:$F$129,4,FALSE)","v":"Norway"},{"$f":"VLOOKUP(B18,Players!$C$2:$F$129,3,FALSE)","v":"Wood Elves"},{"$f":"FixturePaste!C17","v":"Mubo "},{"$f":"VLOOKUP(E18,Players!$C$2:$F$129,4,FALSE)","v":"England"},{"$f":"VLOOKUP(E18,Players!$C$2:$F$129,3,FALSE)","v":"Amazons"}]
[17,{"$f":"FixturePaste!B18","v":"Purdindas "},{"$f":"VLOOKUP(B19,Players!$C$2:$F$129,4,FALSE)","v":"Scotland"},{"$f":"VLOOKUP(B19,Players!$C$2:$F$129,3,FALSE)","v":"Undead"},{"$f":"FixturePaste!C18","v":"Jokaero "},{"$f":"VLOOKUP(E19,Players!$C$2:$F$129,4,FALSE)","v":"Switzerland"},{"$f":"VLOOKUP(E19,Players!$C$2:$F$129,3,FALSE)","v":"Vampires"}]
[18,{"$f":"FixturePaste!B19","v":"Garrick "},{"$f":"VLOOKUP(B20,Players!$C$2:$F$129,4,FALSE)","v":"Scotland"},{"$f":"VLOOKUP(B20,Players!$C$2:$F$129,3,FALSE)","v":"Chaos Dwarves"},{"$f":"FixturePaste!C19","v":"Phifoe "},{"$f":"VLOOKUP(E20,Players!$C$2:$F$129,4,FALSE)","v":"Switzerland"},{"$f":"VLOOKUP(E20,Players!$C$2:$F$129,3,FALSE)","v":"Goblins"}]
[19,{"$f":"FixturePaste!B20","v":"DonShula "},{"$f":"VLOOKUP(B21,Players!$C$2:$F$129,4,FALSE)","v":"Scotland"},{"$f":"VLOOKUP(B21,Players!$C$2:$F$129,3,FALSE)","v":"Skaven"},{"$f":"FixturePaste!C20","v":"Macabeo "},{"$f":"VLOOKUP(E21,Players!$C$2:$F$129,4,FALSE)","v":"Switzerland"},{"$f":"VLOOKUP(E21,Players!$C$2:$F$129,3,FALSE)","v":"Chaos Pact"}]
[20,{"$f":"FixturePaste!B21","v":"sann0638 "},{"$f":"VLOOKUP(B22,Players!$C$2:$F$129,4,FALSE)","v":"Scotland"},{"$f":"VLOOKUP(B22,Players!$C$2:$F$129,3,FALSE)","v":"Humans"},{"$f":"FixturePaste!C21","v":"Madmatt13 "},{"$f":"VLOOKUP(E22,Players!$C$2:$F$129,4,FALSE)","v":"Switzerland"},{"$f":"VLOOKUP(E22,Players!$C$2:$F$129,3,FALSE)","v":"Norse"}]
[21,{"$f":"FixturePaste!B22","v":"Loki "},{"$f":"VLOOKUP(B23,Players!$C$2:$F$129,4,FALSE)","v":"Scotland"},{"$f":"VLOOKUP(B23,Players!$C$2:$F$129,3,FALSE)","v":"Underworld"},{"$f":"FixturePaste!C22","v":"Strider84 "},{"$f":"VLOOKUP(E23,Players!$C$2:$F$129,4,FALSE)","v":"Switzerland"},{"$f":"VLOOKUP(E23,Players!$C$2:$F$129,3,FALSE)","v":"Goblins"}]
[22,{"$f":"FixturePaste!B23","v":"JamesEs "},{"$f":"VLOOKUP(B24,Players!$C$2:$F$129,4,FALSE)","v":"Scotland"},{"$f":"VLOOKUP(B24,Players!$C$2:$F$129,3,FALSE)","v":"Vampires"},{"$f":"FixturePaste!C23","v":"sigu70 "},{"$f":"VLOOKUP(E24,Players!$C$2:$F$129,4,FALSE)","v":"Switzerland"},{"$f":"VLOOKUP(E24,Players!$C$2:$F$129,3,FALSE)","v":"Wood Elves"}]
[23,{"$f":"FixturePaste!B24","v":"Valen "},{"$f":"VLOOKUP(B25,Players!$C$2:$F$129,4,FALSE)","v":"Scotland"},{"$f":"VLOOKUP(B25,Players!$C$2:$F$129,3,FALSE)","v":"Nurgle's Rotters"},{"$f":"FixturePaste!C24","v":"Elrik "},{"$f":"VLOOKUP(E25,Players!$C$2:$F$129,4,FALSE)","v":"Switzerland"},{"$f":"VLOOKUP(E25,Players!$C$2:$F$129,3,FALSE)","v":"High Elves"}]
[24,{"$f":"FixturePaste!B25","v":"HumptyTrump "},{"$f":"VLOOKUP(B26,Players!$C$2:$F$129,4,FALSE)","v":"Scotland"},{"$f":"VLOOKUP(B26,Players!$C$2:$F$129,3,FALSE)","v":"Skaven"},{"$f":"FixturePaste!C25","v":"Goss "},{"$f":"VLOOKUP(E26,Players!$C$2:$F$129,4,FALSE)","v":"Switzerland"},{"$f":"VLOOKUP(E26,Players!$C$2:$F$129,3,FALSE)","v":"Humans"}]
[25,{"$f":"FixturePaste!B26","v":"Araznaroth "},{"$f":"VLOOKUP(B27,Players!$C$2:$F$129,4,FALSE)","v":"Belgium"},{"$f":"VLOOKUP(B27,Players!$C$2:$F$129,3,FALSE)","v":"Goblins"},{"$f":"FixturePaste!C26","v":"Purrelito "},{"$f":"VLOOKUP(E27,Players!$C$2:$F$129,4,FALSE)","v":"Viking"},{"$f":"VLOOKUP(E27,Players!$C$2:$F$129,3,FALSE)","v":"Skaven"}]
[26,{"$f":"FixturePaste!B27","v":"Dekra1979 "},{"$f":"VLOOKUP(B28,Players!$C$2:$F$129,4,FALSE)","v":"Belgium"},{"$f":"VLOOKUP(B28,Players!$C$2:$F$129,3,FALSE)","v":"High Elves"},{"$f":"FixturePaste!C27","v":"brocCooli "},{"$f":"VLOOKUP(E28,Players!$C$2:$F$129,4,FALSE)","v":"Viking"},{"$f":"VLOOKUP(E28,Players!$C$2:$F$129,3,FALSE)","v":"Slann"}]
[27,{"$f":"FixturePaste!B28","v":"Driesfield "},{"$f":"VLOOKUP(B29,Players!$C$2:$F$129,4,FALSE)","v":"Belgium"},{"$f":"VLOOKUP(B29,Players!$C$2:$F$129,3,FALSE)","v":"Slann"},{"$f":"FixturePaste!C28","v":"Mufflo "},{"$f":"VLOOKUP(E29,Players!$C$2:$F$129,4,FALSE)","v":"Viking"},{"$f":"VLOOKUP(E29,Players!$C$2:$F$129,3,FALSE)","v":"Ogres"}]
[28,{"$f":"FixturePaste!B29","v":"JJ "},{"$f":"VLOOKUP(B30,Players!$C$2:$F$129,4,FALSE)","v":"Belgium"},{"$f":"VLOOKUP(B30,Players!$C$2:$F$129,3,FALSE)","v":"Underworld"},{"$f":"FixturePaste!C29","v":"Duckwing "},{"$f":"VLOOKUP(E30,Players!$C$2:$F$129,4,FALSE)","v":"Viking"},{"$f":"VLOOKUP(E30,Players!$C$2:$F$129,3,FALSE)","v":"Vampires"}]
[29,{"$f":"FixturePaste!B30","v":"gninocker "},{"$f":"VLOOKUP(B31,Players!$C$2:$F$129,4,FALSE)","v":"Belgium"},{"$f":"VLOOKUP(B31,Players!$C$2:$F$129,3,FALSE)","v":"Vampires"},{"$f":"FixturePaste!C30","v":"Bernuz "},{"$f":"VLOOKUP(E31,Players!$C$2:$F$129,4,FALSE)","v":"Viking"},{"$f":"VLOOKUP(E31,Players!$C$2:$F$129,3,FALSE)","v":"Lizardmen"}]
[30,{"$f":"FixturePaste!B31","v":"Malodoror "},{"$f":"VLOOKUP(B32,Players!$C$2:$F$129,4,FALSE)","v":"Belgium"},{"$f":"VLOOKUP(B32,Players!$C$2:$F$129,3,FALSE)","v":"Chaos Pact"},{"$f":"FixturePaste!C31","v":"Balder "},{"$f":"VLOOKUP(E32,Players!$C$2:$F$129,4,FALSE)","v":"Viking"},{"$f":"VLOOKUP(E32,Players!$C$2:$F$129,3,FALSE)","v":"Dark Elves"}]
[31,{"$f":"FixturePaste!B32","v":"Phoenix11 "},{"$f":"VLOOKUP(B33,Players!$C$2:$F$129,4,FALSE)","v":"Belgium"},{"$f":"VLOOKUP(B33,Players!$C$2:$F$129,3,FALSE)","v":"Dark Elves"},{"$f":"FixturePaste!C32","v":"Corwin "},{"$f":"VLOOKUP(E33,Players!$C$2:$F$129,4,FALSE)","v":"Viking"},{"$f":"VLOOKUP(E33,Players!$C$2:$F$129,3,FALSE)","v":"Chaos Pact"}]
[32,{"$f":"FixturePaste!B33","v":"Woete "},{"$f":"VLOOKUP(B34,Players!$C$2:$F$129,4,FALSE)","v":"Belgium"},{"$f":"VLOOKUP(B34,Players!$C$2:$F$129,3,FALSE)","v":"Chaos Dwarves"},{"$f":"FixturePaste!C33","v":"Faccko "},{"$f":"VLOOKUP(E34,Players!$C$2:$F$129,4,FALSE)","v":"Viking"},{"$f":"VLOOKUP(E34,Players!$C$2:$F$129,3,FALSE)","v":"Dwarves"}]
[33,{"$f":"FixturePaste!B34","v":"Dionysian "},{"$f":"VLOOKUP(B35,Players!$C$2:$F$129,4,FALSE)","v":"Wales"},{"$f":"VLOOKUP(B35,Players!$C$2:$F$129,3,FALSE)","v":"Dark Elves"},{"$f":"FixturePaste!C34","v":"Obeliz "},{"$f":"VLOOKUP(E35,Players!$C$2:$F$129,4,FALSE)","v":"Spain"},{"$f":"VLOOKUP(E35,Players!$C$2:$F$129,3,FALSE)","v":"Chaos"}]
[34,{"$f":"FixturePaste!B35","v":"SFisher91 "},{"$f":"VLOOKUP(B36,Players!$C$2:$F$129,4,FALSE)","v":"Wales"},{"$f":"VLOOKUP(B36,Players!$C$2:$F$129,3,FALSE)","v":"Chaos Pact"},{"$f":"FixturePaste!C35","v":"Barry "},{"$f":"VLOOKUP(E36,Players!$C$2:$F$129,4,FALSE)","v":"Spain"},{"$f":"VLOOKUP(E36,Players!$C$2:$F$129,3,FALSE)","v":"High Elves"}]
[35,{"$f":"FixturePaste!B36","v":"Ploppy_McPloppy "},{"$f":"VLOOKUP(B37,Players!$C$2:$F$129,4,FALSE)","v":"Wales"},{"$f":"VLOOKUP(B37,Players!$C$2:$F$129,3,FALSE)","v":"Slann"},{"$f":"FixturePaste!C36","v":"Malasnoticias "},{"$f":"VLOOKUP(E37,Players!$C$2:$F$129,4,FALSE)","v":"Spain"},{"$f":"VLOOKUP(E37,Players!$C$2:$F$129,3,FALSE)","v":"Chaos Pact"}]
[36,{"$f":"FixturePaste!B37","v":"20Phoenix "},{"$f":"VLOOKUP(B38,Players!$C$2:$F$129,4,FALSE)","v":"Wales"},{"$f":"VLOOKUP(B38,Players!$C$2:$F$129,3,FALSE)","v":"Chaos Dwarves"},{"$f":"FixturePaste!C37","v":"Tactel "},{"$f":"VLOOKUP(E38,Players!$C$2:$F$129,4,FALSE)","v":"Spain"},{"$f":"VLOOKUP(E38,Players!$C$2:$F$129,3,FALSE)","v":"High Elves"}]
[37,{"$f":"FixturePaste!B38","v":"andydavo "},{"$f":"VLOOKUP(B39,Players!$C$2:$F$129,4,FALSE)","v":"Wales"},{"$f":"VLOOKUP(B39,Players!$C$2:$F$129,3,FALSE)","v":"Ogres"},{"$f":"FixturePaste!C38","v":"Dark Duke "},{"$f":"VLOOKUP(E39,Players!$C$2:$F$129,4,FALSE)","v":"Spain"},{"$f":"VLOOKUP(E39,Players!$C$2:$F$129,3,FALSE)","v":"Chaos Dwarves"}]
[38,{"$f":"FixturePaste!B39","v":"MadeofWelsh "},{"$f":"VLOOKUP(B40,Players!$C$2:$F$129,4,FALSE)","v":"Wales"},{"$f":"VLOOKUP(B40,Players!$C$2:$F$129,3,FALSE)","v":"Lizardmen"},{"$f":"FixturePaste!C39","v":"Joanet "},{"$f":"VLOOKUP(E40,Players!$C$2:$F$129,4,FALSE)","v":"Spain"},{"$f":"VLOOKUP(E40,Players!$C$2:$F$129,3,FALSE)","v":"Khemri"}]
{"$rows_left_out":27}
{"sheet":"Buttons","index":4,"n_rows":0,"n_cols":0,"rows_kept":0,"cut":false,"hidden":false,"merged":[]}